{"text_format":"1","workbook":"xlsx","n_sheets":4,"sheets":["Form","Instructions","Sheet2","Sheet1"],"not_rendered":{"charts":0,"images":5,"macros":1,"external_links":1,"defined_names":6,"comments":0,"pivot_tables":0},"unopened":[],"bounds":{"document_bytes":16777216,"sheet_cells":100000,"rows_first":2000,"rows_last":500,"rows_between":2000,"halvings":0,"cell_chars":16384,"cell_head_chars":4096},"cells_cut":0,"cells_raw":0,"read":"whole","date_system":"1900"}

{"sheet":"Form","index":0,"n_rows":19,"n_cols":13,"rows_kept":19,"cut":false,"hidden":false,"merged":[[20,2,20,3],[20,5,20,6],[20,9,20,10],[20,7,20,8],[18,2,18,3],[18,5,18,6],[18,8,18,9],[7,4,7,7],[8,4,8,7],[1,2,1,12],[2,2,2,12],[4,2,4,12],[5,8,5,10],[6,9,6,12],[7,9,7,12],[8,9,8,12],[7,2,7,3],[6,2,6,3],[6,4,6,7],[9,9,9,12],[13,2,13,12],[9,4,9,7],[8,2,8,3],[9,2,9,3],[11,2,11,3],[10,2,10,3]]}
[]
[]
[null,null,"Any complaint that is to be dealt with by a hearing before the Tribunal must be in the form prescribed by the Regulation, and must be filed no later than the complaint deadline as shown on the Assessment Notice. Please email the completed complaint form to LPRT.Appeals@gov.ab.ca. Fee payments must be made by cheque or money order payable to \"Government of Alberta\" and sent to the LPRT office, no later than the complaint deadline. "]
[]
[null,null,"Part 1 - Contact Information "]
[null,null,"Complainant ",null,null,null,null,null,"Complainant Name or Agent/Organization Name: (if different)"]
[null,null,"Assessed Person:",null,null,null,null,null,"Contact Name:"]
[null,null,"Company Name: ",null,null,null,null,null,"Address:"]
[null,null,"Address:",null,null,null,null,null,"Phone Number:"]
[null,null,"Email Address:",null,null,null,null,null,"Email Address:"]
[null,null,"Discussed Complaint with Provinicial Assessor?"]
[null,null,null,null,null,null,null,null,null,null,null,null,"yes"]
[null,null,null,null,null,null,null,null,null,null,null,null,"no"]
[null,null,"Part 2 - Complaint Information"]
[null," ","Property \nLPAUID","Property Type","AssessMun_AJ\n_MA ID","Matter of \nComplaint","Issue \nCategory","Current \nAssessment","Requested \nAssessed Value","Incorrect \nInformation","Why Information\n is Incorrect","Correct \nInformation","Summary of Issues \nPosition and Grounds"]
[null,{"$f":"IFERROR(_xlfn.XLOOKUP(Table1[[#This Row],[Property Type]],Sheet1!$A$2:$A$12,Sheet1!$B$2:$B$12),\" \")","v":" "}]
[null,{"$f":"IFERROR(_xlfn.XLOOKUP(Table1[[#This Row],[Property Type]],Sheet1!$A$2:$A$12,Sheet1!$B$2:$B$12),\" \")","v":" "}]
[]
[null,null,"Total Filing Fee:",null,{"$f":"IFERROR(SUM($B16:$B17),\"0\")","v":0},"Total properties under complaint:",null,{"$f":"COUNTA(C16:C17)","v":0},"Applicant's Signature:",null,null,"Date:"]

{"sheet":"Instructions","index":1,"n_rows":67,"n_cols":8,"rows_kept":67,"cut":false,"hidden":true,"merged":[[10,2,12,13],[14,2,14,13],[21,2,21,13],[66,2,67,13],[18,2,19,19],[25,2,25,19],[42,3,42,4],[43,3,43,4],[44,3,44,4],[45,3,45,4],[46,3,46,4],[47,3,47,4],[48,3,48,4],[49,3,49,4],[16,2,16,13],[23,2,23,13]]}
[]
[]
[null,null,null,null,null,"Designated Industrial Property Complaint Form"]
[null,null,null,null,null,"(Section 491(1) of the Municipal Government Act)"]
[null,null,null,null,null,"Part 2 "]
[]
[null,null,null,null,null,"Important Information"]
[]
[]
[]
[1,null,"If this complaint is being filed on behalf of the assessed owner or taxpayer by an agent, the prescribed Agent Authorization form must be completed by the owner or taxpayer of the property and must be submitted with this complaint form.  The Authorization form is available on the Land and Property Rights Tribunal (LPRT) Website, under Forms and Resources at https://www.alberta.ca/lprt-forms-and-resources.aspx. "]
[]
[]
[]
[2,null,"The complaint form must be accompanied by the complaint fee as set by the Regulation."]
[]
[3,null,"This complaint form must include:\n   a)   the reason the matter is being referred to the Tribunal;\n   b)   a brief explanation of the issues to be decided by the Tribunal; and\n   c)   an address to which any notice or decision of the Tribunal is to be sent.\n"]
[]
[4,null,"In addition to the information described in 3, in respect of a complaint about an assessment for designated industrial property, this complaint form must:\n   a)   indicate what information on an assessment notice is incorrect; \n   b)   explain in what respect that information is incorrect; \n   c)   indicate what the correct information is; and \n   d)   identify the requested assessed value, if the complaint relates to an assessment."]
[]
[]
[5,null,"Your completed complaint form and any supporting attachments, the Agent Authorization form, and the prescribed filing fee (MRAC, Schedule 2) must be submitted to the LPRT by the deadline indicated on the assessment notice. Complaints with an incomplete complaint form, complaints submitted after the filing deadline, or complaints without the required filing fee, are invalid and the LPRT may dismiss the complaint.                               "]
[]
[6,null,"To sign the document:\n   a) when opening the document, click “Enable Content” on the Security Warning bar and “View Signatures” on the Signatures bar that pops up at the top of the screen; \n   b) ensure the document is saved with a new name; and\n   c) navigate to the “Signatures” menu bar on the right side of the screen, click on the dropdown button on the top right corner of “Signer 1,” and select “Sign.”"]
[]
[7,null,"The LPRT may not hear any matter in support of an issue that is not identified on the complaint form."]
[]
[8,null,"Abbreviations and Fees"]
[]
[null,null,"Property Type","Fees","Description",null,"Category of Complaint Code","Category of Complaint Description"]
[null,null,"CBL",50,"Cable TV",null,"EA","Exempt of Assessment"]
[null,null,"ELE",50,"Electric Power Systems",null,"LA","Legal Argument"]
[null,null,"GDP",50,"Gas Distribution",null,"LD","Legal Description / Location"]
[null,null,"PL",50,"Pipeline",null,"LI","Legislative Interpretation"]
[null,null,"RL",50,"Railway",null,"NB","Property Not Built"]
[null,null,"TEL",50,"Telecommunication",null,"MA","Municipal Allocation"]
[null,null,"WL",50,"Well",null,"NA","Not Assessable"]
[null,null,"EPG",650,"Electrical Power Gen",null,"OM","Omission"]
[null,null,"MP/F",650,"Major Plant or Facility",null,"OW","Ownership"]
[null,null,"LP-O",50,"Linear Property – Other",null,"AA","Schedule A - ACC"]
[null,null,"DIP-O",50,"Designated Industrial Property – Other ",null,"AT","Schedule A - IC"]
[null,null,null,null,null,null,"AC","Schedule A - Cost Factor"]
[null,null,"Matter for Complaint Code","Matter for Complaint Description",null,null,"AB","Schedule A - Base Cost"]
[null,null,"DS","Description of any linear property",null,null,"BA","Schedule B - AYM Factor"]
[null,null,"AD","Name and address of an assessed person",null,null,"CC","Schedule C - Code"]
[null,null,"AS","An Assessment",null,null,"CF","Schedule C - Factor"]
[null,null,"IT ","Type of improvement",null,null,"DC","Schedule D - Code"]
[null,null,"SS","School Support",null,null,"DF","Schedule D - Factor"]
[null,null,"AP ","Linear Property is assessable",null,null,"OT","Other"]
[null,null,"EX","Linear Property exempt from taxation under Part 10",null,null,"AB","Abandoned"]
[null,null,null,null,null,null,"ER","Error in AEUB Record"]
[null,null,null,null,null,null,"DP","Depreciation"]
[null,null,null,null,null,null,"D","Discontinued"]
[null,null,null,null,null,null,"MS","GDP No. of Meter Sets"]
[null,null,null,null,null,null,"SL","GDP No. of Service Lines"]
[null,null,null,null,null,null,"PD","Pipe Diameter"]
[null,null,null,null,null,null,"PL","Pipe Length"]
[null,null,null,null,null,null,"PM","Pipe Material"]
[null,null,null,null,null,null,"PP","Pipe Pressure"]
[null,null,null,null,null,null,"PS","Pipe Status"]
[null,null,null,null,null,null,"WD","Well Depth"]
[null,null,null,null,null,null,"WS","Well Status"]
[null,null,null,null,null,null,"AQ","Schedule A - Qty"]
[]
[]
[]
[null,null,"The personal information collected is for the purpose of setting up application/appeal proceedings which will be provided to those who may be affected by your\napplication/appeal and will be considered a public record. Your contact information will be used to send a follow up survey designed to measure satisfaction with the\ntribunal proceedings. This personal information collection is authorized by section 33(c) of the Freedom of Information and Protection of Privacy Act. If you have any\nquestions about the collection of personal information, you may contact the Land and Property Rights Tribunal, 1229-91 Street, SW, Edmonton, Alberta T6X 1E9,\n(780) 427-2444 (Outside of Edmonton call 310-0000 to be connected toll free) or by email to LPRT@gov.ab.ca."]

{"sheet":"Sheet2","index":2,"n_rows":39,"n_cols":9,"rows_kept":39,"cut":false,"hidden":true,"merged":[]}
["Yes/No"]
["yes"]
["no"]
[]
["Non EPG"]
["Category of Complaint Code","Category of Complaint Description",null,null,null,null,null,"Matter for Complaint Code","Matter for Complaint Description"]
["EA","Exempt of Assessment",null,null,null,null,null,"DS","Description of any linear property"]
["LA","Legal Argument",null,null,null,null,null,"AD","Name and address of an assessed person"]
["LD","Legal Description / Location",null,null,null,null,null,"AS","An Assessment"]
["LI","Legislative Interpretation",null,null,null,null,null,"IT ","Type of improvement"]
["NB","Property Not Built",null,null,null,null,null,"SS","School Support"]
["MA","Municipal Allocation",null,null,null,null,null,"AP ","Linear Property is assessable"]
["NA","Not Assessable",null,null,null,null,null,"EX","Linear Property exempt from taxation under Part 10"]
["OM","Omission"]
["OW","Ownership"]
["AA","Schedule A - ACC"]
["AT","Schedule A - IC"]
["AC","Schedule A - Cost Factor"]
["AB","Schedule A - Base Cost"]
["BA","Schedule B - AYM Factor"]
["CC","Schedule C - Code"]
["CF","Schedule C - Factor"]
["DC","Schedule D - Code"]
["DF","Schedule D - Factor"]
["OT","Other"]
["AB","Abandoned"]
["ER","Error in AEUB Record"]
["DP","Depreciation"]
["D","Discontinued"]
["MS","GDP No. of Meter Sets"]
["SL","GDP No. of Service Lines"]
["PD","Pipe Diameter"]
["PL","Pipe Length"]
["PM","Pipe Material"]
["PP","Pipe Pressure"]
["PS","Pipe Status"]
["WD","Well Depth"]
["WS","Well Status"]
["AQ","Schedule A - Qty"]

{"sheet":"Sheet1","index":3,"n_rows":12,"n_cols":4,"rows_kept":12,"cut":false,"hidden":true,"merged":[]}
["Property Type","Fees","Description"]
["CBL",50,"Cable TV",{"$f":"IF(Sheet1!C14=A2,\"50\")","v":false}]
["ELE",50,"Electric Power Systems"]
["GDP",50,"Gas Distribution"]
["PL",50,"Pipeline"]
["RL",50,"Railway"]
["TEL",50,"Telecommunication"]
["WL",50,"Well"]
["EPG",650,"Electrical Power Gen"]
["MP/F",650,"Major Plant or Facility"]
["LP-O",50,"Linear Property – Other"]
["DIP-O",50,"Designated Industrial Property – Other "]