{"text_format":"1","workbook":"xlsx","n_sheets":8,"sheets":["Instructions","Submission","Section A","Section B","Section B2-Option 2 BM Unit","Section C","SoC","Approval (Internal Use)"],"not_rendered":{"charts":0,"images":1,"macros":1,"external_links":2,"defined_names":6,"comments":3,"pivot_tables":0},"unopened":[],"bounds":{"document_bytes":16777216,"sheet_cells":100000,"rows_first":2000,"rows_last":500,"rows_between":2000,"halvings":0,"cell_chars":16384,"cell_head_chars":4096},"cells_cut":0,"cells_raw":0,"read":"whole","date_system":"1900"}

{"sheet":"Instructions","index":0,"n_rows":25,"n_cols":4,"rows_kept":25,"cut":false,"hidden":false,"merged":[[0,0,0,2]]}
["TECHNOLOGY INNOVATION AND EMISSIONS REDUCTION REGULATION AGGREGATE BENCHMARK YEARS NOTIFICATION FORM",null,null,"Hide for internal Python use"]
["Introduction",null,"V25.0","RFY"]
[]
[null,"This form is required for aggregate facilities seeking to change their benchmark units and/or reference years under the Technology Innovation and Emissions Reduction (TIER) Regulation.\n\nThe person responsible for an aggregate facility must submit this form to the department by the regulated deadline if they wish to request benchmark years and/or a benchmark unit that differ from those previously approved.\n\nFor detailed reporting requirements, please refer to:\n- Sections 7, 15, and 23 of the TIER Regulation\n- Standard for Completing Greenhouse Gas Compliance and Forecasting Reports\n- Standard for Developing Benchmarks"]
["SGER Consolidated Form v3.0 (2012)"]
["Legal Authority"]
[]
[null,"The requirements described above are administered under the authority of the Emissions Management and Climate Resilience Act and the Technology Innovation and Emissions Reduction Regulation."]
[]
["Completion Instructions"]
[]
["1.","Enable macros and use the tabs below to navigate through the sections of this form."]
["2.","More information about certain fields can be found in the form of pop-up comments. To view comments, hover the cursor over each cell with a comment. "]
["3.","Complete all applicable sections of this form. Questions can be submitted to EPA.GHG@gov.ab.ca."]
["4.","For items that are not applicable, the N/A checkbox will be set automatically depending on the content of the associated cell(s). Enter 'N/A' in the field itself if a checkbox is not available."]
["5.","Review and check all calculations and entered values for errors."]
["6.","Ensure that the Statement of Certification (SoC) has been signed by the designated Certifying Official.  To do so, ask the Certifying Official to open the workbook and double click on the X in the signature box on the SoC tab of the workbook. Make sure this is the last step before submitting the workbook as any further modifications to the workbook will require it to be signed again. "]
["7.","Submit this form electronically as part of the submission package. See \"Submission\" tab for a summary of required submission documents."]
[]
[]
[]
["Submission Address"]
[]
[null,"Submit electronic documents to:"]
[null,"EPA.GHG@gov.ab.ca"]

{"sheet":"Submission","index":1,"n_rows":35,"n_cols":11,"rows_kept":35,"cut":false,"hidden":false,"merged":[[25,1,25,5],[19,1,19,5],[20,1,20,5],[21,1,21,5],[22,1,22,5],[23,1,23,5],[24,1,24,5],[18,1,18,5],[0,0,0,6],[10,1,11,5],[13,1,13,5],[16,1,16,5],[17,1,17,5],[5,0,5,6],[9,0,9,6],[15,0,15,6]]}
["Submission Information",null,null,null,null,null,null,null,"HIDE","HIDE","HIDE"]
[]
[null,null,null,null,null,null,null,null,1,"Select from the dropdown list",{"$f":"INDEX(J3:J6,I3)","v":"Select from the dropdown list"}]
["Application Type",null,null,null,null,null,null,null,null,"Change of Benchmark Unit(s)"]
[null,null,null,null,null,null,null,null,null,"Change of Reference Year(s)"]
["Effective Compliance Year for the Application",null,null,null,null,null,null,null,null,"Change of Benchmark Unit(s) and Reference Year(s)"]
[]
[null,"Year "]
[]
["Confidentiality Request"]
[null,"Are you requesting confidentiality under Section 28 of the Technology Innovation and Emissions Reduction (TIER)  Regulation for a portion of the information contained in this report?"]
[null,null,null,null,null,null,null,null,1,"Select from the dropdown list",{"$f":"INDEX(J12:J14,I12)","v":"Select from the dropdown list"}]
[null,null,null,null,null,null,null,null,null,"Yes"]
[null,"Note: If yes, a written request with appropriate justification and supporting documentation must be submitted with this report. Confidentiality must not be requested for information that is publicly available. EPA will contact you regarding your request. One confidentiality request must be submitted for each facility that is requesting confidentiality.",null,"NOTE: If yes, a written request with appropriate justification and supporting documentation must be submitted with this report. Confidentiality must not be requested for information that is publicly available. Alberta Environment will contact you regarding your request. One confidentiality request must be submitted for each facility that is requesting confidentiality.","NOTE: If yes, a written request with appropriate justification and supporting documentation must be submitted with this report. Confidentiality must not be requested for information that is publicly available. Alberta Environment will contact you regarding your request. One confidentiality request must be submitted for each facility that is requesting confidentiality.","NOTE: If yes, a written request with appropriate justification and supporting documentation must be submitted with this report. Confidentiality must not be requested for information that is publicly available. Alberta Environment will contact you regarding your request. One confidentiality request must be submitted for each facility that is requesting confidentiality.",null,null,null,"No"]
[]
["Required Submission Documents"]
["1.                                                                                                                                                                                                                                                                                                                                                                                                                                                                                                                                                            ","TIER Regulation_benchmark years notification form (this form): The completed form must be submitted in the original file format (.XLS) downloaded from the EPA website."]
["2.",{"$f":"IF((OR(#REF!={1,2,3})),\"Third Party Verification Report.\",\"Third Party Verification Report. (Only if verification was required by the director)\")","v":{"$error":"#REF!"}}]
["3.",{"$f":"IF((OR(#REF!={1,2,3})),\"Conflict of Interest Checklist: Signed by the third party assurance provider.\",\"Conflict of Interest Checklist: Signed by the third party assurance provider. (Only if verification was required by the director)\")","v":{"$error":"#REF!"}}]
["4.",{"$f":"IF((OR(#REF!={1,2,3})),\"Statement of Qualifications: Signed by the third party assurance provider.\",\"Statement of Qualifications: Signed by the third party assurance provider. (Only if verification was required by the director)\")","v":{"$error":"#REF!"}}]
["5.",{"$f":"IF((OR(#REF!={1,2,3})),\"Statement of Verification: Signed by the third party assurance provider.\",\"Statement of Verification: Signed by the third party assurance provider. (Only if verification was required by the director)\")","v":{"$error":"#REF!"}}]
[2,{"$f":"\"Statement of Certification: Signed by the certifying official.\"","v":"Statement of Certification: Signed by the certifying official."}]
[3,{"$f":"\"Confidentiality Request Letter: If requesting confidentiality on any information provided with the TIER Regulation submission.\"","v":"Confidentiality Request Letter: If requesting confidentiality on any information provided with the TIER Regulation submission."}]
[4,{"$f":"\"Additional Supporting Documents: If applicable.\"","v":"Additional Supporting Documents: If applicable."}]
[]
[]
[]
[]
[]
[null,null,null,null,null,null,null,null,2,"Select from the dropdown list",{"$f":"INDEX(J30:J35,I30)","v":2025}]
[null,null,null,null,null,null,null,null,1,2025]
[null,null,null,null,null,null,null,null,null,2026]
[null,null,null,null,null,null,null,null,null,2027]
[null,null,null,null,null,null,null,null,null,2028]
[null,null,null,null,null,null,null,null,null,2029]

{"sheet":"Section A","index":2,"n_rows":52,"n_cols":7,"rows_kept":52,"cut":false,"hidden":false,"merged":[[0,0,0,4]]}
["Section A: Administrative Information",null,null,null,null,null,"hide"]
[]
[null,"Aggregate Facility Information"]
[null,"Aggregate Facility Name"]
[]
[null,"Aggregate Facility ID"]
[]
[]
[null,"Reporting Company"]
[null,"Reporting Company Legal Name"]
[]
[]
[null,"Reporter"]
["Title",null,null,null,null,null,"Mr."]
[null,null,null,null,null,null,"Ms."]
["First Name",null,null,"Last Name",null,null,"Mrs."]
[null,null,null,null,null,null,"Miss"]
["Position/Title",null,null,"E-mail Address",null,null,"Dr."]
[]
["Telephone Number (eg. 780-123-4567 ext 8)"]
[]
["Mailing Address",null,"City/District/Municipality/County"]
[]
["Province",null,"Postal Code"]
[]
[]
[null,"Certifying Official"]
["Title"]
[]
["First Name",null,null,"Last Name"]
[]
["Position/Title",null,null,"E-mail Address"]
[]
["Telephone Number (eg. 780-123-4567 ext 8)"]
[]
["Mailing Address",null,"City/District/Municipality/County"]
[]
["Province",null,"Postal Code"]
[]
[]
{"$rows_left_out":13}
{"sheet":"Section B","index":3,"n_rows":39,"n_cols":17,"rows_kept":39,"cut":false,"hidden":false,"merged":[[34,5,38,5],[34,7,38,7],[0,0,0,6],[6,1,6,3],[9,5,10,5],[9,7,10,7],[10,1,10,2],[2,0,2,8],[29,5,30,5],[29,7,30,7],[27,1,27,12],[13,5,17,5],[13,7,17,7],[13,9,17,9]]}
["Section B: Benchmark Unit and Reference Year Information",null,null,null,null,null,null,null,null,null,null,null,null,null,null,"HIDE","HIDE"]
[]
["Most Recent Approved Benchmark Unit and Reference Years"]
[null,"Approved Benchmark Unit"]
[]
[]
[null,"Approved Reference Years"]
[null,"Please enter the most recent reference years approved by EPA in the table below.",null,null,null,null,null,null,null,null,null,null,null,null,1,"Select from the dropdown list",{"$f":"INDEX(P8:P13,O8)","v":"Select from the dropdown list"}]
[null,null,null,null,null,null,null,null,null,null,null,null,null,null,null,"Production"]
[null,null,null,null,"First \nReference Year",null,"Second\nReference Year",null,"Third\nReference Year",null,null,null,null,null,null,"Receipts"]
[null,null,null,null,null,null,null,null,null,null,null,null,null,null,null,"Disposition"]
[null,null,null,null,null,null,null,null,null,null,null,null,null,null,null,"Receipts excluding ZEFs"]
[null,"Correlation analysis results based on the most recent approved reference years and benchmark unit",null,null,null,null,null,null,null,null,null,null,null,null,null,"Disposition excluding ZEFs"]
[null,null,"Year(s)",null,"Production Accounting to TRE Correlation (rAgg)",null,"Production Accounting to SFC Correlation (rAgg _SFC)",null,"Production Accounting to Flaring Correlation (rAgg_F)"]
[null,null,{"$f":"E11","v":0}]
[null,null,{"$f":"G11","v":0}]
[null,null,{"$f":"I11","v":0}]
[null,null,"All Years Combined"]
[]
[]
["Request Reference years or Benchmark Unit"]
[null,null,null,null,null,null,null,null,null,null,null,null,null,null,1]
[null,"Requested Benchmark Unit "]
[null,"Enter the requested benchmark unit below. If no change is requested, enter the most recently approved benchmark unit."]
[]
[]
[null,"Requested Reference Years"]
[null,"Enter the requested reference years in the table below. If no change is requested, enter the most recently approved reference years.",null,null,null,null,null,null,null,null,null,null,null,null,1,"Select from the dropdown list",{"$f":"INDEX(P28:P33,O28)","v":"Select from the dropdown list"}]
[null,null,null,null,null,null,null,null,null,null,null,null,null,null,null,"Production"]
[null,null,null,null,"First \nReference Year",null,"Second\nReference Year",null,"Third\nReference Year",null,null,null,null,null,null,"Receipts"]
[null,null,null,null,null,null,null,null,null,null,null,null,null,null,null,"Disposition"]
[null,null,null,null,null,null,null,null,null,null,null,null,null,null,null,"Receipts excluding ZEFs"]
[null,"A correlation analysis based on the approved/requested years with the requested / approved benchmark unit",null,null,null,null,null,null,null,null,null,null,null,null,null,"Disposition excluding ZEFs"]
[]
[null,null,"Year(s)",null,"Production Accounting to TRE Correlation (rAgg)",null,"Production Accounting to SFC Correlation (rAgg_SFC)",null,"Production Accounting to Flaring Correlation (rAgg_F)",null,null,null,null,null,null,"No change",{"$f":"INDEX(P35:P36,O30)","v":"No change"}]
[null,null,{"$f":"E31","v":0},null,null,null,null,null,null,null,null,null,null,null,null,"Request new reference years","Request new reference years"]
[null,null,{"$f":"G31","v":0}]
[null,null,{"$f":"I31","v":0}]
[null,null,"All Years Combined"]

{"sheet":"Section B2-Option 2 BM Unit","index":4,"n_rows":69,"n_cols":33,"rows_kept":69,"cut":false,"hidden":true,"merged":[[66,1,66,16],[69,2,69,4],[0,0,0,6],[6,1,6,16],[56,3,56,11],[57,4,57,10],[59,1,59,16]]}
["Section B2"]
[]
[null,"Option 2 – Alternative Benchmark Unit"]
[]
[null,"Key Petrinex Production Accounting Features"]
[]
[null,"Use this section if you are seeking a benchmark unit from Option 2. Please refer to Sections 9.1.2 of the Standards for developing benchmarks.\nInput the correlation production to SFC and flaring correlation factor rx for each Petrinex production accounting metric that the aggregate facility is applying to include in its benchmark unit. If the aggregate facility is applying to include more that one Petrinex production accounting metric, also input the linear regression coefficient for each production accounting metric. \nIf using the EPA Microsoft Excel® model for Option 2, fill the table below with the data from the Inputs tab of the tool."]
[null,"Note: The selection of Activity ID - Product ID pairs must be the same for each of the benchmark years."]
[null,"First BenchmarkYear"]
[]
[null,null,"ActivityID",null,"Benchmark Unit",null,"Production Unit",null,"Production to SFC and Flaring Correlation (rx)",null,"Linear Regression Coefficient (cn)",null,null,null,null,null,null,null,null,null,null,"Single",null,"Multiple",null,null,null,null,"x fn","fn","units"]
[null,null,null,null,null,null,null,null,null,null,null,null,null,null,null,null,null,null,null,null,{"$f":"I12=\"\"","v":true},{"$f":"IF(I12=0,0,1)","v":0},{"$f":"IF(V12=1,CONCATENATE(C12,\" \",E12,\" (\",G12,\")\"),\"\")","v":""},{"$f":"IF(K12=0,\"\",CONCATENATE(K12,AC12))","v":""},{"$f":"IF(K12=0,0,1)","v":0},{"$f":"Y12","v":0},{"$f":"IF(Y12=1,X12,\"\")","v":""},null,{"$f":"CONCATENATE(\" x \",C12,\" \",E12)","v":" x  "},{"$f":"IF(V12=1,CONCATENATE(C12,\" \",E12),\"\")","v":""},null,null,"DISP"]
[null,null,null,null,null,null,null,null,null,null,null,null,null,null,null,null,null,null,null,null,null,null,null,{"$f":"IF(K13=0,\"\",CONCATENATE(K13,\" x DISP\"))","v":""},null,null,null,null,null,"",null,null,"FRAC"]
[null,null,null,null,null,null,null,null,null,null,null,null,null,null,null,null,null,null,null,null,{"$f":"I14=\"\"","v":true},{"$f":"IF(I14=0,0,1)","v":0},{"$f":"IF(V14=1,CONCATENATE(C14,\" \",E14,\" (\",G14,\")\"),\"\")","v":""},{"$f":"IF(K14=0,\"\",CONCATENATE(K14,AC14))","v":""},{"$f":"IF(K14=0,0,1)","v":0},{"$f":"Z12+Y14","v":0},{"$f":"IF(Y14=1,IF(Z14>1,CONCATENATE(\" + \",X14),X14),\"\")","v":""},{"$f":"IF(Y14=1,IF(Z14>1,CONCATENATE(\" + \",X14),X14),\"\")","v":""},{"$f":"CONCATENATE(\" x \",C14,\" \",E14)","v":" x  "},"",null,null,"INJ"]
[null,null,null,null,null,null,null,null,null,null,null,null,null,null,null,null,null,null,null,null,null,null,null,{"$f":"IF(K15=0,\"\",CONCATENATE(K15,\" x DISP\"))","v":""},null,null,null,null,null,"",null,null,"LDINJ"]
[null,null,null,null,null,null,null,null,null,null,null,null,null,null,null,null,null,null,null,null,{"$f":"I16=\"\"","v":true},{"$f":"IF(I16=0,0,1)","v":0},{"$f":"IF(V16=1,CONCATENATE(C16,\" \",E16,\" (\",G16,\")\"),\"\")","v":""},{"$f":"IF(K16=0,\"\",CONCATENATE(K16,AC16))","v":""},{"$f":"IF(K16=0,0,1)","v":0},{"$f":"Z14+Y16","v":0},{"$f":"IF(Y16=1,IF(Z16>1,CONCATENATE(\" + \",X16),X16),\"\")","v":""},null,{"$f":"CONCATENATE(\" x \",C16,\" \",E16)","v":" x  "},"",null,null,"LDREC"]
[null,null,null,null,null,null,null,null,null,null,null,null,null,null,null,null,null,null,null,null,null,null,null,{"$f":"IF(K17=0,\"\",CONCATENATE(K17,\" x DISP\"))","v":""},null,null,null,null,null,"",null,null,"PLTUSE"]
[null,null,null,null,null,null,null,null,null,null,null,null,null,null,null,null,null,null,null,null,{"$f":"I18=\"\"","v":true},{"$f":"IF(I18=0,0,1)","v":0},{"$f":"IF(V18=1,CONCATENATE(C18,\" \",E18,\" (\",G18,\")\"),\"\")","v":""},{"$f":"IF(K18=0,\"\",CONCATENATE(K18,AC18))","v":""},{"$f":"IF(K18=0,0,1)","v":0},{"$f":"Z16+Y18","v":0},{"$f":"IF(Y18=1,IF(Z18>1,CONCATENATE(\" + \",X18),X18),\"\")","v":""},null,{"$f":"CONCATENATE(\" x \",C18,\" \",E18)","v":" x  "},"",null,null,"PROC"]
[null,null,null,null,null,null,null,null,null,null,null,null,null,null,null,null,null,null,null,null,null,null,null,{"$f":"IF(K19=0,\"\",CONCATENATE(K19,\" x DISP\"))","v":""},null,null,null,null,null,"",null,null,"PROD"]
[null,null,null,null,null,null,null,null,null,null,null,null,null,null,null,null,null,null,null,null,{"$f":"I20=\"\"","v":true},{"$f":"IF(I20=0,0,1)","v":0},{"$f":"IF(V20=1,CONCATENATE(C20,\" \",E20,\" (\",G20,\")\"),\"\")","v":""},{"$f":"IF(K20=0,\"\",CONCATENATE(K20,AC20))","v":""},{"$f":"IF(K20=0,0,1)","v":0},{"$f":"Z18+Y20","v":0},{"$f":"IF(Y20=1,IF(Z20>1,CONCATENATE(\" + \",X20),X20),\"\")","v":""},null,{"$f":"CONCATENATE(\" x \",C20,\" \",E20)","v":" x  "},"",null,null,"PURREC"]
[]
[]
[null,"Second BenchmarkYear"]
[]
[null,null,"ActivityID",null,"Benchmark Unit",null,"Production Unit",null,"Production to SFC and Flaring Correlation (rx)",null,"Linear Regression Coefficient (cn)"]
[null,null,null,null,null,null,null,null,null,null,null,null,null,null,null,null,null,null,null,null,{"$f":"I26=\"\"","v":true},{"$f":"IF(I26=0,0,1)","v":0},{"$f":"IF(V26=1,CONCATENATE(C26,\" \",E26,\" (\",G26,\")\"),\"\")","v":""},{"$f":"IF(K26=0,\"\",CONCATENATE(K26,AC26))","v":""},{"$f":"IF(K26=0,0,1)","v":0},{"$f":"Z20+Y26","v":0},{"$f":"IF(Y26=1,IF(Z26>1,CONCATENATE(\" + \",X26),X26),\"\")","v":""},null,{"$f":"CONCATENATE(\" x \",C26,\" \",E26)","v":" x  "},{"$f":"IF(V26=1,CONCATENATE(C26,\" \",E26),\"\")","v":""},null,null,"REC"]
[null,null,null,null,null,null,null,null,null,null,null,null,null,null,null,null,null,null,null,null,null,null,null,{"$f":"IF(K27=0,\"\",CONCATENATE(K27,\" x DISP\"))","v":""},null,null,null,null,null,"",null,null,"RECYC"]
[null,null,null,null,null,null,null,null,null,null,null,null,null,null,null,null,null,null,null,null,{"$f":"I28=\"\"","v":true},{"$f":"IF(I28=0,0,1)","v":0},{"$f":"IF(V28=1,CONCATENATE(C28,\" \",E28,\" (\",G28,\")\"),\"\")","v":""},{"$f":"IF(K28=0,\"\",CONCATENATE(K28,AC28))","v":""},{"$f":"IF(K28=0,0,1)","v":0},{"$f":"Z26+Y28","v":0},{"$f":"IF(Y28=1,IF(Z28>1,CONCATENATE(\" + \",X28),X28),\"\")","v":""},null,{"$f":"CONCATENATE(\" x \",C28,\" \",E28)","v":" x  "},"",null,null,"SHR"]
[null,null,null,null,null,null,null,null,null,null,null,null,null,null,null,null,null,null,null,null,null,null,null,{"$f":"IF(K29=0,\"\",CONCATENATE(K29,\" x PROD\"))","v":""},null,null,null,null,null,"",null,null,"UTIL"]
[null,null,null,null,null,null,null,null,null,null,null,null,null,null,null,null,null,null,null,null,{"$f":"I30=\"\"","v":true},{"$f":"IF(I30=0,0,1)","v":0},{"$f":"IF(V30=1,CONCATENATE(C30,\" \",E30,\" (\",G30,\")\"),\"\")","v":""},{"$f":"IF(K30=0,\"\",CONCATENATE(K30,AC30))","v":""},{"$f":"IF(K30=0,0,1)","v":0},{"$f":"Z28+Y30","v":0},{"$f":"IF(Y30=1,IF(Z30>1,CONCATENATE(\" + \",X30),X30),\"\")","v":""},null,{"$f":"CONCATENATE(\" x \",C30,\" \",E30)","v":" x  "},""]
[null,null,null,null,null,null,null,null,null,null,null,null,null,null,null,null,null,null,null,null,null,null,null,{"$f":"IF(K31=0,\"\",CONCATENATE(K31,\" x DISP\"))","v":""},null,null,null,null,null,""]
[null,null,null,null,null,null,null,null,null,null,null,null,null,null,null,null,null,null,null,null,{"$f":"I32=\"\"","v":true},{"$f":"IF(I32=0,0,1)","v":0},{"$f":"IF(V32=1,CONCATENATE(C32,\" \",E32,\" (\",G32,\")\"),\"\")","v":""},{"$f":"IF(K32=0,\"\",CONCATENATE(K32,AC32))","v":""},{"$f":"IF(K32=0,0,1)","v":0},{"$f":"Z30+Y32","v":0},{"$f":"IF(Y32=1,IF(Z32>1,CONCATENATE(\" + \",X32),X32),\"\")","v":""},null,{"$f":"CONCATENATE(\" x \",C32,\" \",E32)","v":" x  "},""]
[null,null,null,null,null,null,null,null,null,null,null,null,null,null,null,null,null,null,null,null,null,null,null,{"$f":"IF(K33=0,\"\",CONCATENATE(K33,\" x DISP\"))","v":""},null,null,null,null,null,""]
[null,null,null,null,null,null,null,null,null,null,null,null,null,null,null,null,null,null,null,null,{"$f":"I34=\"\"","v":true},{"$f":"IF(I34=0,0,1)","v":0},{"$f":"IF(V34=1,CONCATENATE(C34,\" \",E34,\" (\",G34,\")\"),\"\")","v":""},{"$f":"IF(K34=0,\"\",CONCATENATE(K34,AC34))","v":""},{"$f":"IF(K34=0,0,1)","v":0},{"$f":"Z32+Y34","v":0},{"$f":"IF(Y34=1,IF(Z34>1,CONCATENATE(\" + \",X34),X34),\"\")","v":""},null,{"$f":"CONCATENATE(\" x \",C34,\" \",E34)","v":" x  "},""]
[]
[]
[null,"Third  BenchmarkYear"]
[]
[null,null,"ActivityID",null,"Benchmark Unit",null,"Production Unit",null,"Production to SFC and Flaring Correlation (rx)",null,"Linear Regression Coefficient (cn)"]
[null,null,null,null,null,null,null,null,null,null,null,null,null,null,null,null,null,null,null,null,null,null,null,{"$f":"IF(K40=0,\"\",CONCATENATE(K40,\" x DISP\"))","v":""},null,null,null,null,null,{"$f":"IF(V40=1,CONCATENATE(C40,\" \",E40),\"\")","v":""}]
{"$rows_left_out":30}
{"sheet":"Section C","index":5,"n_rows":6,"n_cols":2,"rows_kept":6,"cut":false,"hidden":false,"merged":[[7,1,109,7],[2,1,2,7],[3,1,3,7],[4,1,4,7],[5,1,5,7],[6,1,6,7]]}
[null,"Section C: Justification for the Requested Change(s)"]
[null,"1. Complete this section if you are requesting a change to the previously approved benchmark unit(s), reference year(s) or both."]
[null,"2. As per section 7 (6) of the TIER regulation, please provide a clear rationale for the requested change(s), along with relevant supporting documentation. "]
[null,"3. Submit any supporting evidence for the proposed change(s), including production trend analysis, emissions correlation analysis, and any associated plots, drawings, or explanatory notes. "]
[null,"4. If you are submitting attachments with this document, please list them in the space provided below."]
[null,"5. You may use the space below (press Alt + Enter to insert a line break for additional details)"]

{"sheet":"SoC","index":6,"n_rows":28,"n_cols":6,"rows_kept":28,"cut":false,"hidden":false,"merged":[[28,1,28,5],[18,1,18,5],[19,1,20,3],[14,1,15,5],[0,1,0,6],[1,1,1,6],[2,1,2,6],[13,2,13,5],[10,1,10,3]]}
[]
[null,"Statement of Certification"]
[]
[null,"Associated Tier Regulation Submission"]
[]
[null,"Aggregate Facility ID",null,"Application Efffective Compliance Year",null,"Requested Benchmark Unit"]
[null,{"$f":"'Section A'!B7","v":0},null,{"$f":"Submission!K30","v":2025},null,{"$f":"'Section B'!Q28","v":"Select from the dropdown list"}]
[]
[null,"Aggregate Facility Name",null,"Application Type",null,"Requested Reference Years"]
[null,{"$f":"'Section A'!B5","v":0},null,{"$f":"Submission!K3","v":"Select from the dropdown list"},null,{"$f":"'Section B'!E31&\" \"&'Section B'!G31&\" \"&'Section B'!I31","v":"  "}]
[]
[null,"Signature of Certifying Official"]
[null,"   I, (certifying official),"]
[null,{"$f":"'Section A'!B31&\" \"&'Section A'!D31","v":" "}]
[null,"having the authority to bind the reporting company, hereby, certify that I have reviewed the information being submitted, that I have exercised due diligence to ensure that the information is true and complete. I understand and commit to adhere to the regulatory requirements which may result from acceptance of this notification."]
[]
[]
[]
[null,"Signature of Certifying Official (Double click on the X to sign)                                                                                             Date (YYYY-MM-DD)"]
[]
[]
[]
[null,"Last Name",null,"First Name"]
[null,{"$f":"'Section A'!D17","v":0},null,{"$f":"'Section A'!B17","v":0}]
[]
[]
[null,"Position/Title",null,"E-mail Address",null,"Phone Number"]
[null,{"$f":"'Section A'!B19","v":0},null,{"$f":"'Section A'!D19","v":0},null,{"$f":"'Section A'!B21","v":0}]

{"sheet":"Approval (Internal Use)","index":7,"n_rows":40,"n_cols":7,"rows_kept":40,"cut":false,"hidden":true,"merged":[[0,0,0,7],[38,1,38,4],[36,1,36,4],[34,0,34,7],[9,0,17,7],[27,0,33,7],[21,0,21,7],[8,0,8,7]]}
["Approval for Changes to Benmark Unit(s) and/or Reference Year(s)"]
[]
[null,"Aggregate Facility ID",null,null,"Application Effective Year",null,"Requested Benchmark Unit"]
[null,{"$f":"SoC!B7","v":0},null,null,{"$f":"SoC!D7","v":2025},null,{"$f":"SoC!F7","v":"Select from the dropdown list"}]
[]
[null,"Aggregate Facility Name",null,null,"Application Type",null,"Requested Benchmark Years"]
[null,{"$f":"SoC!B10","v":0},null,null,{"$f":"SoC!D10","v":"Select from the dropdown list"},null,{"$f":"SoC!F10","v":"  "}]
[]
["Reviewer's Comments"]
[]
[]
[]
[]
[]
[]
[]
[]
[]
[null,"Reviewer",null,null,null,null,"Date"]
[]
[]
["Director's Comments"]
[]
[]
[]
[]
[]
[]
[]
[]
[]
[]
[]
[]
["Director's Approval "]
[]
[]
[null,"Signature"]
[]
[null,"Director, Conventional Oil and Gas",null,null,null,null,"Date"]