{"text_format":"1","workbook":"xlsx","n_sheets":8,"sheets":["Instruction","Intro","Introduction","Inputs","BreedingSystems","PerformancebySystem","Sheet1","PreliminaryCompare"],"not_rendered":{"charts":0,"images":16,"macros":1,"external_links":0,"defined_names":31,"comments":4,"pivot_tables":0},"unopened":[],"bounds":{"document_bytes":16777216,"sheet_cells":100000,"rows_first":2000,"rows_last":500,"rows_between":2000,"halvings":0,"cell_chars":16384,"cell_head_chars":4096},"cells_cut":0,"cells_raw":0,"read":"whole","date_system":"1900"}

{"sheet":"Instruction","index":0,"n_rows":4,"n_cols":2,"rows_kept":4,"cut":false,"hidden":false,"merged":[]}
[null,"Welcome To The Comparison of Beef Natural Service to Estrus Synchronization and Artificial Insemination "]
[null,"This Workbook includes a number of spreadsheets that allows YOU, the reader, to compare the expected results from the use of estrus synchronization and artificial insemination (AI) with that of natural service for a beef herd."]
[null,"Workbook Tabs:\n• ‘Instruction’: Overview of the workings of this workbook\n• ‘Intro’: the purpose of this partial budgeting tool, considerations in the analysis, and a description of the 10 breeding systems selected for comparison purposes\n• ‘Inputs’: the input spreadsheet allowing you to provide a description of your beef operation (breeding size, weaning weight, bull costs, labor costs, semen costs, and pharmaceutical costs)  and allows you to select a protocol from a series of 10 breeding systems for comparison. Based on the selected breeding system, a series of target performances are suggested. You can use these target performances as a guideline for estimating the performance of your herd - OR - you can adjust these guidelines to reflect YOUR own experience or best estimate. All input information is highlighted in BLUE.   Upon completion of your input, press the 'proceed to Partial Budget Analysis Results' button. The results look at key input factors required under natural service and how these may change. \nFactors that impact revenue:\no Increases in productivity resulting from changes in weaning weights and weaning rates; \no Decreases resulting from fewer culled bulls and open cows;\nFactors Impacting costs:\no Bulls are a major cost factor (price and maintenance). Decreases as a result of requiring fewer bulls (feed & yardage, veterinarian costs, maintenance...); fewer replacement animals needed with improved pregnancy rates; labour requirements for heat detection \no Increases as a result of semen costs, AI technician, labour with handling cattle; cost of drugs and supplies for the AI treatments, AI equipment maintenance and depreciation.\n • ‘PerformancebySystem’: provides a guideline of recommended performance targets for each breeding system under consideration. "]
[null,"Breeding Systems:  Considerable research and field data support the use and refinement of protocols. These protocols draw on those recommended by the Beef Reproduction Task Force: Beef Cow Protocols - 2018 (www.beefrepro.unl.edu/resources).  Analysis focuses on ten proven systems which can be categorized to three groupings based on the general requirements for estrus detection:\n1) estrus detection over a 7-8 day period following synchronization treatment (4 options), \n2) estrus detection  over a 3 day period with timed AI of all remaining animals not previously detected in estrus (clean-up timed AI) (3 options) \n3) strict fixed-time AI following the prescribed hormonal treatment (3 options).\nHormones recommended in the protocols include prostaglandin F2a (PG), gonadotropin releasing hormone (GnRH), and progestins (like MGA (melengestrol acetate) or CIDR (progesterone))."]

{"sheet":"Intro","index":1,"n_rows":23,"n_cols":2,"rows_kept":23,"cut":false,"hidden":false,"merged":[[24,1,24,13],[18,1,18,13],[1,0,1,13],[2,1,2,13],[3,1,3,13],[12,1,12,13],[4,1,4,13],[6,1,6,13],[8,1,8,13],[10,1,10,13],[14,1,14,13],[16,1,16,13],[20,1,20,13],[22,1,22,13],[4,0,24,0]]}
[]
["Partial Budget Comparison of Natural Service vs Synchronized AI Programs for Beef Cattle"]
["Proposed Comparison: ","This partial budget is designed as a tool to help producers and industry stakeholders compare between options of use of artificial insemination (AI) to that of using natural service bulls for cow-calf operations.  Although AI is widely used in the dairy industry, the current standard practice in beef is that of relying solely on bull breeding.  There are trade-offs when comparing the breeding programs, specifically, differences in costs,  conception rates and synchronization methods."]
["Considerations:  ","Protocol comparisons (based primarily on those recommended by the Beef Reproduction Task Force: Beef Cow Protocols - 2018, www.beefrepro.unl.edu/resource) look at three protocol groupings based on time required for estrus detection: estrus detection and AI; AI for 3 days after observed estrus and then fixed-timed AI of all nonresponders (cleanup-timed AI); or strict, fixed-time AI.     \nAdvantages of synchronized AI may include:\n• Shortening and concentrating the calving and breeding season \n• Increasing the time needed for postpartum recovery in cows and first-calf heifers \n• The ability to induce anestrous cows and prepubertal heifers to cycle \n• Moving the breeding season to an earlier time of year \n• Introducing new genetics into the herd \n• Improving the uniformity of a calf crop (weight, color, disposition) \n• Increasing calf performance and weaning weights with earlier birthdates"]
["Breeding Systems","a. Natural Service - herd bulls limited on the number of cows serviced during the breeding season\n1) Estrus Detection\nb. Select Synch- Gonadotropin-releasing hormone (GnRH) is injected intramuscular (i.m.) day 0 and Prostaglandin (PG) is injected i.m. day 7. Cows are observed for estrus and AI days 6-13."]
[]
[null,"c. Select Synch +Controlled internal drug release (CIDR) - GnRH is injected i.m. day 0, PG is injected i.m. day 7, and a CIDR is inserted intravaginal at the time of GnRH injection and is removed at the time of PG injection. Cows are observed for estrus and AI days 7-13."]
[]
[null,"d. Prostaglandin F2a (PG) 6-day CIDR - PG  on day 0. Heat detect and AI days 0 to 3. Insert CIDR and give GnRH to nonresponders on day 3 and remove it on day 9 along with PG i.m. Heat detect and AI days 9 to 12. "]
[]
[null,"e. Melengestrol acetate (MGA)+PG- for use with heifers - MGA is fed days 1-14 and PG is injected i.m. day 33. Heifers are observed for estrus and AI days 33-39."]
[]
[null,"2) Estrus Detection with Cleanup AI\na. Select Synch +Timed AI (TAI) - GnRH is injected i.m. day 0 and PG is injected i.m. day 7. Cows are observed for estrus and AI days 6-10 followed by GnRH and TAI day 10 for all cows not AI by day 10. \n"]
[]
[null,"\nb. Select Synch+CIDR+TAI - GnRH is injected i.m. day 0, PG is injected i.m. day 7, and a CIDR is inserted intravaginal at the time of GnRH injection and is removed at the time of PG injection. Cows and heifers are observed for estrus and AI days 7-10 followed by GnRH and TAI day 10 for all cows and heifers not AI by day 10. "]
{"$rows_left_out":9}
{"sheet":"Introduction","index":2,"n_rows":0,"n_cols":0,"rows_kept":0,"cut":false,"hidden":true,"merged":[]}

{"sheet":"Inputs","index":3,"n_rows":145,"n_cols":22,"rows_kept":145,"cut":false,"hidden":false,"merged":[[143,1,143,13],[7,5,7,6],[131,8,131,10],[130,8,130,10],[126,1,126,3],[133,8,133,10],[117,8,117,10],[127,1,127,3],[133,1,133,3],[117,1,117,3],[118,1,118,3],[119,8,119,10],[118,8,118,10],[122,1,122,3],[124,1,124,3],[114,1,114,13],[128,8,128,10],[8,7,8,8],[134,1,134,3],[141,1,141,13],[142,1,142,13],[134,8,134,10],[122,8,122,10],[132,8,132,10],[129,8,129,10],[124,8,124,10]]}
[]
[null,"Comparison:"]
[null,null,null,null,"vs",null,"Select one of the following:"]
[null,"Breeding system:","Estrus_Detection",null,null,"Breeding system:","Estrus_Detection"]
[null,"Protocol: ","Natural Service",null,null,"Protocol: ","Select Synch +CIDR"]
[{"$f":"+C5","v":"Natural Service"},"Code:",{"$f":"VLOOKUP(C5,R99:S109,2,FALSE)","v":1},null,null,"Code:",{"$f":"VLOOKUP(G5,R99:S109,2,FALSE)","v":3}]
[]
[null,null,{"$f":"+C5","v":"Natural Service"},null,null,{"$f":"+G5","v":"Select Synch +CIDR"}]
[null,null,null,"Your Estimate",null,"Your Estimate",null,"Target Performance"]
[null,"Number of cows in the herd",null,100,"head",100,"head",{"$f":"IF(Inputs!$G$6=2, PerformancebySystem!D20,IF(Inputs!$G$6=3,PerformancebySystem!E20,IF(Inputs!$G$6=4,PerformancebySystem!F20,IF(Inputs!$G$6=5,PerformancebySystem!G20, IF(Inputs!$G$6=6,PerformancebySystem!H20,IF(Inputs!$G$6=7,PerformancebySystem!I20,IF(Inputs!$G$6=8,PerformancebySystem!J20,IF(Inputs!$G$6=9,PerformancebySystem!K20,IF(Inputs!$G$6=10,PerformancebySystem!L20,IF(Inputs!$G$6=11,PerformancebySystem!M20,0))))))))))","v":100}]
[null,"Cows/bull ",null,25,null,25,null,{"$f":"IF(Inputs!$G$6=2, PerformancebySystem!D21,IF(Inputs!$G$6=3,PerformancebySystem!E21,IF(Inputs!$G$6=4,PerformancebySystem!F21,IF(Inputs!$G$6=5,PerformancebySystem!G21, IF(Inputs!$G$6=6,PerformancebySystem!H21,IF(Inputs!$G$6=7,PerformancebySystem!I21,IF(Inputs!$G$6=8,PerformancebySystem!J21,IF(Inputs!$G$6=9,PerformancebySystem!K21,IF(Inputs!$G$6=10,PerformancebySystem!L21,IF(Inputs!$G$6=11,PerformancebySystem!M21,0))))))))))","v":25}]
[null,"Breeding season days",null,83,null,60,null,{"$f":"IF(Inputs!$G$6=2, PerformancebySystem!D22,IF(Inputs!$G$6=3,PerformancebySystem!E22,IF(Inputs!$G$6=4,PerformancebySystem!F22,IF(Inputs!$G$6=5,PerformancebySystem!G22, IF(Inputs!$G$6=6,PerformancebySystem!H22,IF(Inputs!$G$6=7,PerformancebySystem!I22,IF(Inputs!$G$6=8,PerformancebySystem!J22,IF(Inputs!$G$6=9,PerformancebySystem!F22,IF(Inputs!$G$6=10,PerformancebySystem!L22,IF(Inputs!$G$6=11,PerformancebySystem!M22,0))))))))))","v":60}]
[null,"Bulls needed",null,{"$f":"+D10/D11","v":4},"head",{"$f":"H13","v":2},"head",{"$f":"IF(Inputs!$G$6=2, PerformancebySystem!D23,IF(Inputs!$G$6=3,PerformancebySystem!E23,IF(Inputs!$G$6=4,PerformancebySystem!F23,IF(Inputs!$G$6=5,PerformancebySystem!G23, IF(Inputs!$G$6=6,PerformancebySystem!H23,IF(Inputs!$G$6=7,PerformancebySystem!I23,IF(Inputs!$G$6=8,PerformancebySystem!J23,IF(Inputs!$G$6=9,PerformancebySystem!F23,IF(Inputs!$G$6=10,PerformancebySystem!L23,IF(Inputs!$G$6=11,PerformancebySystem!M23,0))))))))))","v":2}]
[null,"End of season pregnancy rate*",null,90,"%",95,"%",{"$f":"IF(Inputs!$G$6=2, PerformancebySystem!D27,IF(Inputs!$G$6=3,PerformancebySystem!E27,IF(Inputs!$G$6=4,PerformancebySystem!F27,IF(Inputs!$G$6=5,PerformancebySystem!G27, IF(Inputs!$G$6=6,PerformancebySystem!H27,IF(Inputs!$G$6=7,PerformancebySystem!I27,IF(Inputs!$G$6=8,PerformancebySystem!J27,IF(Inputs!$G$6=9,PerformancebySystem!F27,IF(Inputs!$G$6=10,PerformancebySystem!L27,IF(Inputs!$G$6=11,PerformancebySystem!M27,0))))))))))","v":95}]
[null,"Percent calving rate*",null,98,"%",93,"%",{"$f":"IF(Inputs!$G$6=2, PerformancebySystem!D29,IF(Inputs!$G$6=3,PerformancebySystem!E29,IF(Inputs!$G$6=4,PerformancebySystem!F29,IF(Inputs!$G$6=5,PerformancebySystem!G29, IF(Inputs!$G$6=6,PerformancebySystem!H29,IF(Inputs!$G$6=7,PerformancebySystem!I29,IF(Inputs!$G$6=8,PerformancebySystem!J29,IF(Inputs!$G$6=9,PerformancebySystem!F29,IF(Inputs!$G$6=10,PerformancebySystem!L29,IF(Inputs!$G$6=11,PerformancebySystem!M29,0))))))))))","v":93}]
{"$rows_left_out":131}
{"sheet":"BreedingSystems","index":4,"n_rows":64,"n_cols":36,"rows_kept":64,"cut":false,"hidden":true,"merged":[]}
["Breeding system",null,null,null,null,null,null,"System 1",null,null,"Insemination method:",null,null,"Code","Estrus AI:","Code","Estrus AI with Cleanup AI","Code","Fixed-time AI"]
[null,null,null,null,null,null,null,"cows ",{"$f":"Inputs!D10","v":100},null,"estrus AI",null,null,2,"Select Synch",5,"Select Synch +TAI",8,"7-day CO-Synch + CIDR",null,null,null,null," Difference",null,"Treatment costs"]
["Costs of AI:",null,null,"Labour / working",null,null,null,null,null,null,"estrus AI with cleanup AI",null,null,3,"Select Synch +CIDR",6,"Select Synch+CIDR+TAI",9,"5-day CO-Synch + CIDR",null,null,null,null,null,1,2,3,4,5,6,7,8,9,10,11]
["Cost of prostaglandin/dose",5.25,null,"hours",{"$f":"+#REF!/23","v":{"$error":"#REF!"}},null,null,"System 2",null,null,"fixed-time AI",null,null,4,"PGF2α 6-day CIDR",7,"PGF2α 6 Day CIDR +TAI",10,"7-day Co-synch + CIDR with Estradiol",null,null,null,null,1,0,{"$f":"P11-P59","v":850},{"$f":"P23-P59","v":2650},{"$f":"+P36-P59","v":2752.5},{"$f":"P48-P59","v":654},{"$f":"R11-P59","v":850.69999999999993},{"$f":"R23-P59","v":2720},{"$f":"R36-P59","v":2822.5},{"$f":"T11-P59","v":3000},{"$f":"T23-P59","v":3500},{"$f":"T36-P59","v":2700}]
["Cost of GnRH",3,null,"workers",{"$f":"#REF!/#REF!","v":{"$error":"#REF!"}},null,null,"cows ",{"$f":"Inputs!F10","v":100},null,null,null,null,1,"MGA+PGF2α",null,null,null,null,null,null,null,null,2,null,0,{"$f":"P23-P11","v":1800},{"$f":"P36-P11","v":1902.5},{"$f":"P48-P11","v":-196},{"$f":"R11-P11","v":0.69999999999993179},{"$f":"R23-P11","v":1870},{"$f":"R36-P11","v":1972.5},{"$f":"T11-P11","v":2150},{"$f":"T23-P11","v":2650},{"$f":"T36-P11","v":1850}]
["CIDR",15,null,"wage rate",20,null,null,null,null,null,"Input Costs",null,null,null,"Natural Service",null,null,null,null,null,null,null,null,3,null,null,0,{"$f":"P36-P23","v":102.5},{"$f":"P48-P23","v":-1996},{"$f":"R11-P23","v":-1799.3000000000002},{"$f":"R23-P23","v":70},{"$f":"R36-P23","v":172.5},{"$f":"T11-P23","v":350},{"$f":"T23-P23","v":850},{"$f":"T36-P23","v":50}]
["Cost of pregnancy diagnosis",3,null,null,null,null,null,null,null,null,"Labor costs ($/hr):",null,{"$f":"Inputs!F71","v":20},null,"Select Synch",null,{"$f":"+Q2","v":"Select Synch +TAI"},null,{"$f":"+S2","v":"7-day CO-Synch + CIDR"},null,55,null,null,4,null,null,null,0,{"$f":"P48-P36","v":-2098.5},{"$f":"R11-P36","v":-1901.8000000000002},{"$f":"R23-P36","v":-32.5},{"$f":"R36-P36","v":70},{"$f":"T11-P36","v":247.5},{"$f":"T23-P36","v":747.5},{"$f":"T36-P36","v":-52.5}]
[null,null,"Drugs, Supplies ($)","Required Workings","Materials ($)","Technician ($)","Semen ($)",null,null,null,"PG ($/dose):",null,{"$f":"Inputs!C69","v":5},null,"handling",3,"handling",3,"handling",3,null,null,null,5,null,null,null,null,0,{"$f":"R11-P48","v":196.69999999999993},{"$f":"R23-P48","v":2066},{"$f":"R36-P48","v":2168.5},{"$f":"T11-P48","v":2346},{"$f":"T23-P48","v":2846},{"$f":"T36-P48","v":2046}]
["synchronization (per herd)",null,1250,null,{"$f":"0.92*#REF!","v":{"$error":"#REF!"}},null,null,null,null,null,"GnRH ($/dose):",null,{"$f":"Inputs!C70","v":3.5},null,"labour hrs /cow (not HD)",{"$f":"P15+P16","v":0.27999999999999997},"labour hrs",{"$f":"R15+R16","v":0.28899999999999998},"labour hrs",{"$f":"T15+T16","v":0.28999999999999998},null,null,null,6,null,null,null,null,null,0,{"$f":"R23-R11","v":1869.3000000000002},{"$f":"R36-R11","v":1971.8000000000002},{"$f":"T11-R11","v":2149.3000000000002},{"$f":"R11","v":850.69999999999993},{"$f":"R11","v":850.69999999999993}]
["heat detection (per cow)",null,null,1,null,null,null,null,null,null,"CIDR ($/insert):",null,{"$f":"Inputs!C71","v":18},null,"treatment cost/cow",{"$f":"(M9+(M8))","v":8.5},"cost/cow",{"$f":"(M9+M8)+(((1-$J$50)/100)*(M9))","v":8.5069999999999997},"cost/cow",{"$f":"(M9+M10+M8+M9)","v":30},null,null,null,7,null,null,null,null,null,null,0,{"$f":"R36-R23","v":102.5},{"$f":"T11-R23","v":280},{"$f":"T23-R23","v":780},{"$f":"T36-R23","v":-20}]
["1st service (per cow)",null,null,1,null,20,26.6,null,null,null,"Semen ($/unit):",null,{"$f":"Inputs!C73","v":25},null,"total",{"$f":"(P10*I5)","v":850},"total",{"$f":"(R10*I5)","v":850.69999999999993},"total",{"$f":"+T10*I5","v":3000},null,null,null,8,null,null,null,null,null,null,null,0,{"$f":"T11-R36","v":177.5},{"$f":"-R36","v":-2822.5},{"$f":"T36-R36","v":-122.5}]
["2nd service (per cow)",null,null,1,null,20,26.6,null,null,null,"Estradiol",null,{"$f":"+Inputs!C74","v":2},null,null,null,null,null,null,null,null,null,null,9,null,null,null,null,null,null,null,null,0,{"$f":"T23-T11","v":500},{"$f":"T36-T11","v":-300}]
["3rd service (per cow)",null,null,null,null,null,null,null,null,null,"MGA",null,{"$f":"+Inputs!C76","v":0.11},null,"Cleanup bulls",{"$f":"((1-N39)*I5)/PerformancebySystem!D21","v":2.46},"Cleanup bulls",{"$f":"((1-N43)*I5)/PerformancebySystem!H21","v":2.12},"Cleanup bulls",{"$f":"(I5-(I5*PerformancebySystem!K26/100))/PerformancebySystem!K21","v":1.7999999999999998},null,null,null,10,null,null,null,null,null,null,null,null,null,0,{"$f":"T36-T23","v":-800}]
[null,null,null,null,null,null,null,null,null,null,null,"cows/hr",null,null,"heat detection ",{"$f":"+L22","v":7.0000000000000007E-2},"heat detection ",{"$f":"(4*M27/60*M28)/$I$2","v":0.04},"heat detection ",0,null,null,null,11,null,null,null,null,null,null,null,null,null,null,0]
[null,null,null,null,null,null,null,null,null,null,"insert CIDR",{"$f":"Inputs!H69","v":50},null,null,"handling time(2 doses)",{"$f":"(2*I5/L17)/I5","v":0.04},"handling time(3 doses)",{"$f":"((2+(1-K43))*(I5/L17))/I5","v":4.9000000000000002E-2},"handling time(3 doses)",{"$f":"((2*I5/L17)+(I5/L18))/I5","v":0.05}]
{"$rows_left_out":50}
{"sheet":"PerformancebySystem","index":5,"n_rows":41,"n_cols":13,"rows_kept":41,"cut":false,"hidden":false,"merged":[[17,3,17,7],[17,8,17,10],[17,11,17,13],[35,2,38,2]]}
[]
[]
[null,"Code","Protocol"]
[null,1,{"$f":"Inputs!R99","v":"Natural Service"}]
[null,2,"Select Synch"]
[null,3,"Select Synch +CIDR"]
[null,4,"PG 6-day CIDR"]
[null,5,"MGA+PG"]
[null,6,"Select Synch +TAI"]
[null,7,"Select Synch+CIDR+TAI"]
[null,8,"PG 6 Day CIDR +TAI"]
[null,9,"Co-synch_CIDR with GnRH-7day"]
[null,10,"CO-Synch-CIDR-5day"]
[null,11,"Co-synch-CIDR with Estradiol-7day"]
[]
{"$rows_left_out":27}
{"sheet":"Sheet1","index":6,"n_rows":90,"n_cols":32,"rows_kept":90,"cut":false,"hidden":true,"merged":[[78,22,80,23],[78,26,80,26],[79,25,80,25],[79,27,80,27],[70,27,73,27],[71,25,73,25],[70,22,73,22],[70,26,73,26],[73,1,75,9],[76,4,77,4],[76,5,77,5],[76,6,77,6],[56,1,58,9],[59,5,61,5],[59,6,61,6],[60,8,61,8],[45,27,46,27],[52,22,54,27],[55,22,57,22],[55,25,57,25],[55,26,57,26],[55,27,57,27],[44,26,46,26],[43,22,45,24],[36,26,37,26],[44,1,46,1],[44,2,46,2],[44,3,46,3],[44,4,46,4],[44,5,46,5],[27,22,29,23],[28,26,29,26],[30,1,32,1],[30,2,32,2],[30,3,32,3],[30,4,32,4],[30,5,32,5],[30,6,32,6],[30,7,32,7],[30,8,32,8],[30,9,32,9],[30,11,32,11],[31,13,32,13],[31,14,32,14],[18,7,18,8],[18,22,20,25],[19,7,19,8],[19,26,20,26],[21,1,23,1],[21,2,23,2],[21,3,23,3],[21,4,23,4],[21,5,23,5],[21,6,23,6],[0,1,0,9],[0,22,0,27],[1,1,3,3],[1,22,3,26],[10,22,12,23],[11,1,13,1],[11,26,12,26]]}
[null,"Natural Service Costs",null,null,null,null,null,null,null,null,null,null,null,null,null,null,null,null,null,null,null,null,"AI Costs"]
[null,"GENERAL: Natural Service Only",null,null,null,null,null,null,null,null,null,null,null,null,null,null,null,null,null,null,null,null,"GENERAL: AI and  cleanup natural service"]
[]
[]
[null,"Number of cows in the herd",null,100,"head",{"$f":"IF(NatPregRate=0,\"\",IF(NatWeanRate>NatPregRate,\"WARNING: Calving Rate is greater than End of Season Pregnancy Rate\",\"\"))","v":""},null,null,null,null,null,null,null,null,null,null,null,null,null,null,null,null,"Number of cows in the herd",null,{"$f":"HerdSize","v":100},"head"]
[null,"Bulls needed",null,4,"head",null,null,null,null,null,null,null,null,null,null,null,null,null,null,null,null,null,"Clean-up Bulls needed",null,1,"head",{"$f":"IF(AISystemPregRate=0,\"\",IF(AIWeanRate>AISystemPregRate,\"WARNING: Weaning Rate is greater than Pregnancy Rate\",\"\"))","v":""}]
[null,"End of season pregnancy rate",null,93,"%",null,null,null,null,null,null,null,null,null,null,null,null,null,null,null,null,null,"End of season pregnancy rate",null,95,"%"]
[null,"Percent calf crop",null,93,"%",null,null,null,null,null,null,null,null,null,null,null,null,null,null,null,null,null,"Percent calf crop",null,94,"%"]
[null,"Interest rate",null,5,"%",null,null,null,null,null,null,null,null,null,null,null,null,null,null,null,null,null,"Wage rate for AI activities",null,12,"$ / Hr"]
[null,"Calf value",null,900,"$ / head"]
[null,null,null,null,null,null,null,null,null,null,null,null,null,null,null,null,null,null,null,null,null,null,"SYNCHRONIZATION",null,null,null,null,null,null,"head","all cows","non-bred cow"]
[null,"BULL INFORMATION",null,null,null,null,null,null,null,null,null,null,null,null,null,null,null,null,null,null,null,null,null,null,null,null,"per Cow per Year",null,null,"bull","all bulls"]
[]
[null,null,null,null,null,null,null,null,null,null,null,null,null,null,null,null,null,null,null,null,null,null,"Labor",10,"hours per","all cows",{"$f":"IF(HerdSize=0,0,X14*WageRate/IF(Z14=\"all cows\",HerdSize,1))","v":1.2}]
[null,"Bull cost (including delivery)",null,3500,null,null,null,null,null,null,null,null,null,null,null,null,null,null,null,null,null,null,"Drugs, CIDR, supplies",1250,"dollars per","all cows",{"$f":"IF(HerdSize=0,0,X15/IF(Z15=\"all cows\",HerdSize,1))","v":12.5}]
{"$rows_left_out":76}
{"sheet":"PreliminaryCompare","index":7,"n_rows":31,"n_cols":19,"rows_kept":31,"cut":false,"hidden":true,"merged":[[3,7,3,10],[3,11,3,18],[19,7,19,10],[19,11,19,18]]}
[]
[]
[null,null,null,null,null,null," VS Natural Service"]
[null,null,null,null,null,null,null,"GAINS",null,null,null,"LOSSES"]
[null,null,null,"Expected Net Gain",null,null,"Expected Net Gain",{"$f":"Inputs!B118","v":"Increased revenue from proposed change"},{"$f":"Inputs!B127","v":"Fewer bulls required (reduced cost/bull)"},{"$f":"Inputs!B128","v":"fewer replacements needed"},{"$f":"Inputs!B129","v":"heat detection labour"},{"$f":"Inputs!I118","v":"Decreased revenue from proposed change"},{"$f":"Inputs!I126","v":"Semen costs"},{"$f":"Inputs!I127","v":"AI technician"},{"$f":"Inputs!I129","v":"labour - AI treatment"},{"$f":"Inputs!I130","v":"breeding system treatment cost (drugs)"},{"$f":"Inputs!I131","v":"AI supplies (syringes, etc.)"},{"$f":"Inputs!I132","v":"AI Equipment maintenance"},{"$f":"Inputs!I133","v":"Depreciation & interest on AI Equipment"}]
[null,null,null,"Select Synch",257.47954621898407,-162.52045378101502,-202.23155880218837,1314.1985999999902,4120.9448411978219,2500,-140.00000000000003,1224.875,2200,1100,560,850,100,300,1662.5]
[null,null,null,"Select Synch +CIDR",8428.075212885662,8008.075212885662,8444.7576911978194,7658.6878499999993,4120.9448411978219,9985,-120,4497.375,2300,1150,540,2650,100,300,1662.5]
[null,null,null,"PG 6-day CIDR",8292.2418795523281,7872.2418795523281,8302.2576911978213,7658.6878499999993,4120.9448411978219,9985,-120,4497.375,2300,1150,580,2752.5,100,300,1662.5]
[null,null,null,"MGA+PG",10440.74187955233,10020.74187955233,10460.757691197821,7658.6878499999993,4120.9448411978219,9985,-120,4497.375,2300,1150,520,654,100,300,1662.5]
[null,null,null,"Select Synch with E-AI and Cleanup AI",269.54954621898469,-11.85045378101313,-301.67905880218768,1624.1510999999903,4120.9448411978219,2500,-80,1224.875,2500,1250,577.99999999999989,851.4,100,300,1662.5]
[null,null,null,"Select Synch + CIDR with E-AI and Cleanup AI",8441.3052128856616,8021.3052128856616,8211.155191197824,7825.5853499999994,4120.9448411978219,9985,-80,4497.375,2500,1250,557.99999999999989,2772.5,100,300,1662.5]
[null,null,null,"PG 6 Day CIDR with E-AI and Cleanup AI",8521.9938795523212,8101.9938795523212,8279.8116911978177,8059.2418499999958,4120.9448411978219,9985,-120,4497.375,2500,1250,598,2857.5,100,300,1662.5]
[null,null,null,"Co-synch_CIDRwithGnRH-7day",8264.7418795523281,7844.7418795523281,7874.7576911978213,7658.6878499999993,4120.9448411978219,9985,0,4497.375,2500,1250,580,3000,100,300,1662.5]
[null,null,null,"CO-Synch-CIDR-5day",8311.8905462189923,7891.8905462189923,7902.2091911978205,8226.1393499999958,4120.9448411978219,9985,0,4497.375,2500,1250,620,3500,100,300,1662.5]
[null,null,null,"Co-synch-CIDRwithEstradiol-7day",9007.8272128856552,8587.8272128856552,8615.3116911978177,8059.2418499999958,4120.9448411978219,9985,0,4497.375,2500,1250,540,2700,100,300,1662.5]
{"$rows_left_out":16}