{"text_format":"1","workbook":"xlsx","n_sheets":15,"sheets":["Production","NH3 Loss","Overview","Manure Supply","Application","Commercial Fertilizer","Field Identification","Analysis1 - 5 Year Cost","Summary1","Analysis2 - Compare 2 Fields","Summary2","Tables","Composition 1","NPK Composition Wet & Dry Basis","Uptake Imperial"],"not_rendered":{"charts":0,"images":0,"macros":1,"external_links":0,"defined_names":112,"comments":1,"pivot_tables":0},"unopened":[],"bounds":{"document_bytes":16777216,"sheet_cells":100000,"rows_first":2000,"rows_last":500,"rows_between":2000,"halvings":0,"cell_chars":16384,"cell_head_chars":4096},"cells_cut":0,"cells_raw":0,"read":"whole","date_system":"1900"}

{"sheet":"Production","index":0,"n_rows":48,"n_cols":12,"rows_kept":48,"cut":false,"hidden":true,"merged":[]}
[null,null,null," Solid Manure Production Volume"]
[]
[null,"               Species",null,"Daily",null,null,"Monthly",null,null,"Yearly"]
[null,"               ",null,"lbs","kgs","cu ft","lbs","kgs","cu ft","tons","tonnes","cu ft"]
[null,"Beef","Feeders",8.4,3.8,0.21,250,110,6.2,1.53,1.39,75]
[null,"Beef","Finishers – Open Lot",13.1,5.9,0.32,390,180,9.6,2.38,2.16,117]
[null,"Beef","Finishers – Paved Lot",19.8,9,0.43,590,270,12.8,3.61,3.28,156]
[null,"Beef","Feeder Calves <550 lbs",3.3,1.5,0.08,100,50,2.4,0.59,0.54,29]
{"$rows_left_out":41}
{"sheet":"NH3 Loss","index":1,"n_rows":12,"n_cols":6,"rows_kept":12,"cut":false,"hidden":true,"merged":[]}
["Expected Ammonia Loss from Manure"]
[null,null,null,"Ammonia Loss Coeffieicients"]
["Manure Appliation and Incorporation","Average","Cool-Wet","Cool-Dry","Warm-Wet","Warm-Dry "]
[]
["Surface Applied, No Incorporation",0.66,0.4,0.5,0.75,1]
["Surface Applied, Incorporated within 1 day",0.25,0.1,0.15,0.31,0.5]
["Surface Applied, Incorporated 1-2 days",0.3,0.13,0.19,0.38,0.56999999999999995]
["Surface Applied, Incorporated 2-3 days",0.35,0.15,0.22,0.44,0.65]
{"$rows_left_out":5}
{"sheet":"Overview","index":2,"n_rows":30,"n_cols":9,"rows_kept":30,"cut":false,"hidden":false,"merged":[[28,2,28,3],[29,2,29,14],[22,2,22,6],[23,2,23,14],[27,2,27,14],[4,2,4,14],[25,2,25,14],[26,2,26,7],[18,2,18,5],[16,2,16,3],[14,2,14,5],[24,2,24,3],[19,2,19,14],[20,2,20,6],[21,2,21,14],[15,2,15,14],[17,2,17,14]]}
[]
[]
[]
[]
[null,null,"The calculator is designed to assist in the determination of the most economically beneficial and cost effective fields (area) to which manure can be transported and utilized."]
[]
[null,null,"Instructions"]
[]
{"$rows_left_out":23}
{"sheet":"Manure Supply","index":3,"n_rows":23,"n_cols":26,"rows_kept":23,"cut":false,"hidden":false,"merged":[]}
[]
[]
[]
[]
[]
[]
[]
[null,"Livestock:"]
{"$rows_left_out":16}
{"sheet":"Application","index":4,"n_rows":34,"n_cols":14,"rows_kept":34,"cut":false,"hidden":false,"merged":[]}
[]
[]
[]
[]
[]
[]
[]
[]
{"$rows_left_out":27}
{"sheet":"Commercial Fertilizer","index":5,"n_rows":26,"n_cols":15,"rows_kept":26,"cut":false,"hidden":false,"merged":[]}
[]
[]
[]
[]
[]
[]
[]
[]
{"$rows_left_out":19}
{"sheet":"Field Identification","index":6,"n_rows":60,"n_cols":29,"rows_kept":60,"cut":false,"hidden":false,"merged":[[55,19,55,21],[57,19,57,21],[59,19,59,21],[42,19,42,21],[44,19,44,21],[51,19,51,21],[53,19,53,21],[29,19,29,21],[36,19,36,21],[38,19,38,21],[40,19,40,21],[21,19,21,21],[23,19,23,21],[25,19,25,21],[27,19,27,21],[13,3,13,4],[8,3,8,4],[9,3,9,4],[10,3,10,4],[11,3,11,4],[12,3,12,4],[13,17,13,19],[8,17,8,19],[9,17,9,19],[10,17,10,19],[11,17,11,19],[12,17,12,19]]}
[]
[]
[]
[]
[]
[]
[null,null,null,null,null,null,null,null,null,null,"Distance from Manure (mi)",null,"Spreadable Size (acres)"]
[null,"Field ID (Legal Description or Name)",null,null,null,null,null,null,null,null,null,null,null,null,null,null,null,"Year 1 Crops",null,null,null,"N",null,"P",null,"K",null,"S"]
{"$rows_left_out":53}
{"sheet":"Analysis1 - 5 Year Cost","index":7,"n_rows":121,"n_cols":46,"rows_kept":121,"cut":false,"hidden":false,"merged":[]}
[]
[]
[]
[]
[]
[]
[null,null,null,null,null,null,"Distance from Manure (mi)",null,"Spreadable Size (acres)"]
[null,null,null,"Select a Field to Assess",null,null,null,null,null,null,null,null,"N",null,"P",null,"K",null,"S",null,null,null,"N",null,"P2O5",null,"K2O",null,"S"]
{"$rows_left_out":114}
{"sheet":"Summary1","index":8,"n_rows":63,"n_cols":20,"rows_kept":63,"cut":false,"hidden":false,"merged":[[11,4,11,6],[20,6,20,8],[14,7,16,11]]}
[]
[]
[]
[]
[]
[]
[]
[null,null,null,null,null,null,null,null,null,null,null,null,null,null,null,null,null,"Conversion Table"]
{"$rows_left_out":56}
{"sheet":"Analysis2 - Compare 2 Fields","index":9,"n_rows":137,"n_cols":54,"rows_kept":137,"cut":false,"hidden":false,"merged":[]}
[]
[]
[]
[]
[]
[]
[null,null,null,null,null,null,"Distance from Manure (mi)",null,"Spreadable Size (acres)"]
[null,null,null,null,null,null,null,null,null,null,null,null,"N",null,"P2O5",null,"K2O",null,"S",null,null,null,"N",null,"P2O5",null,"K2O",null,"S"]
{"$rows_left_out":130}
{"sheet":"Summary2","index":10,"n_rows":45,"n_cols":31,"rows_kept":45,"cut":false,"hidden":false,"merged":[[30,9,30,11],[30,19,30,21],[11,4,11,6],[20,6,20,8],[11,14,11,16],[20,16,20,18],[14,7,16,11],[14,17,16,21]]}
[]
[]
[]
[]
[]
[]
[]
[null,null,null,null,null,null,null,null,null,null,null,null,null,null,null,null,null,null,null,null,null,null,null,null,null,null,null,null,"Conversion Table"]
{"$rows_left_out":38}
{"sheet":"Tables","index":11,"n_rows":115,"n_cols":88,"rows_kept":115,"cut":false,"hidden":true,"merged":[]}
[null,"TABLES - DEMAND",null,null,null,null,null,null,null,null,null,null,null,null,null,null,null,null,null,null,"TABLES - MANURE PRODUCTION & COMPOSITION",null,null,null,null,null,null,null,null,null,null,null,null,null,null,null,null,null,null,null,null,null,null,null,null,null,null,null,null,"Manure Supply Calculations",null,null,null,null,null,null,null,null,null,null,null,null,null,null,null,"TABLES - APPLICATION CONSIDERATIONS",null,null,null,null,null,null,null,null,null,null,null,null,null,null,null,"Commercial Fertilizer Calculations"]
[]
[null,null,null,null,null,null,null,null,null,null,null,null,null,null,null,null,null,null,null,null,null,null,null,null,null,null,null,null,null,null,null,null,null,null,null,null,null,null,null,null,null,null,null,null,null,null,null,null,null,"Year 1"]
[null,null,null,"Nutrient Uptake by Crop",null,null,null,null,null,null,"Soil N Mineralization",null,null,null,null,null,null,null,null,null,null,null,null,null,null,"Daily Production Volume - Solid Manure",null,null,null,"Daily Production Volume - Liquid Manure",null,null,null,"CompositionSolid",null,null,null,null,null,null,null,"CompositionLiquid",null,null,null,null,null,null,null,"Livestock Species from 1st Input Selector",null,null,null,null,null,null,null,null,null,null,null,null,null,null,null,null,null,null,null,null,"Solid Manure Application Method and Incorporation Inputs",null,null,null,null,null,"Cost Tables - Solid Manure Application & Incorporation",null,null,null,null,"For Use in Solid Manure Calculations:"]
[null,null,null,null,null,"Uptake (lbs/yield unit)",null,null,null,null,null,"Organic Matter (%)",null,"Soil N Mineralization",null,null,null,null,null,null,"Species",null,"Species","Class",null,"Species&Class","lbs","cu ft",null,"Species&Class","gal","cu ft",null,"Species&Class","NTotal","NOrg","NInorg","PTotal","KTotal","STotal",null,"Species&Class","NTotal","NOrg","NInorg","PTotal","KTotal","STotal",null,null,"Selected Species","Selected Class","Manure Type","Production","NTotal","NOrg","NInorg","P2O5","K2O","S",null,null,null,null,null,"Solid Manure Equipment","Selected?","SumProduct",null,null,"Selected Application","Selected Incorporation","Selected Incorp. Lag","NH3 Loss%","Manure Source",null,"Table Range Name: \"CostSpreaderVar\""]
[null,"Soil Texture List:",null,"Crop","Yield Unit","N","P2O5","K2O","S",null,null,"Mean","Range","Mean","Range","Mean","Range",null,null,null,null,null,null,null,null,{"$f":"$W7&$X7","v":"BeefFeeders"},8.4,0.21,null,null,null,null,null,{"$f":"$W7&$X7","v":"BeefFeeders"},0.01,{"$f":"AI6-AK6","v":7.45E-3},2.5499999999999997E-3,2.3999999999999998E-3,6.6500000000000005E-3,{"$f":"1.7/2000","v":8.4999999999999995E-4},null,null,null,null,null,null,null,null,null,null,3,1,2,{"$f":"IF(BB7=0,IF(ISERROR(VLOOKUP(AY7&AZ7,ProductionSolidManure,2,FALSE)),0,VLOOKUP(AY7&AZ7,ProductionSolidManure,2,FALSE)),0)","v":0},{"$f":"IF(ISERROR(VLOOKUP($AY7&$AZ7,CompositionSolid,1,FALSE)),0,VLOOKUP($AY7&$AZ7,CompositionSolid,2,FALSE))","v":4.0000000000000001E-3},{"$f":"IF(ISERROR(VLOOKUP($AY7&$AZ7,CompositionSolid,1,FALSE)),0,VLOOKUP($AY7&$AZ7,CompositionSolid,3,FALSE))","v":2.1999999999999997E-3},{"$f":"IF(ISERROR(VLOOKUP($AY7&$AZ7,CompositionSolid,1,FALSE)),0,VLOOKUP($AY7&$AZ7,CompositionSolid,4,FALSE))","v":1.8000000000000002E-3},{"$f":"IF(ISERROR(VLOOKUP($AY7&$AZ7,CompositionSolid,1,FALSE)),0,VLOOKUP($AY7&$AZ7,CompositionSolid,5,FALSE)*2.29)","v":1.9464999999999999E-3},{"$f":"IF(ISERROR(VLOOKUP($AY7&$AZ7,CompositionSolid,1,FALSE)),0,VLOOKUP($AY7&$AZ7,CompositionSolid,6,FALSE)*1.2)","v":4.9800000000000001E-3},{"$f":"IF(ISERROR(VLOOKUP($AY7&$AZ7,CompositionSolid,1,FALSE)),0,VLOOKUP($AY7&$AZ7,CompositionSolid,7,FALSE))","v":7.5000000000000002E-4},null,null,null,null,null,"Truck Mounted Manure Spreader",false,{"$f":"IF(BO6=TRUE,1,0)","v":0},null,null,1,2,1,{"$f":"IF(BT6=1,$BO$35,INDEX($BN$36:$BO$40,BU6,2))","v":0.25},1,null,"Solid Manure Spreader (variable costs)",null,null,null,null,"Commercial Fertilizer Blend Cost",null,null,null,"Year 1",null,{"$f":"IF(ISERROR('Analysis1 - 5 Year Cost'!#REF!/CF8),0,'Analysis1 - 5 Year Cost'!#REF!/CF8)","v":0}]
[null,"Coarse",null,"Spring Wheat","bu",2.1124999999999998,0.8,1.8125,0.22500000000000001,null,"Soil Zone List:","%","%","lb/ac","lb/ac","kg/ha","kg/ha",null,null,null,"Beef",null,"Beef","Feeders",null,{"$f":"$W8&$X8","v":"BeefFinishers – Open Lot"},13.1,0.32,null,null,null,null,null,{"$f":"$W8&$X8","v":"BeefFinishers – Open Lot"},{"$f":"20/2000","v":0.01},{"$f":"AI7-AK7","v":7.45E-3},2.5499999999999997E-3,2.3999999999999998E-3,6.6500000000000005E-3,8.4999999999999995E-4,null,null,null,null,null,null,null,null,null,null,{"$f":"INDEX(LivestockSpecies,AY6)","v":"Dairy"},{"$f":"INDEX(Class1,AZ6)","v":"Loose Stall"},{"$f":"INDEX(ManureType1,BA6)","v":"Liquid"},{"$f":"IF(ISERROR(VLOOKUP(AY7&AZ7,ProductionLiquidManure,2,FALSE)),0,IF(BA7=\"Liquid\",VLOOKUP(AY7&AZ7,ProductionLiquidManure,2,FALSE),0))","v":25.7},{"$f":"IF(ISERROR(VLOOKUP($AY7&$AZ7,CompositionLiquid,1,FALSE)),0,VLOOKUP($AY7&$AZ7,CompositionLiquid,2,FALSE))","v":4.0000000000000001E-3},{"$f":"IF(ISERROR(VLOOKUP($AY7&$AZ7,CompositionLiquid,1,FALSE)),0,VLOOKUP($AY7&$AZ7,CompositionLiquid,3,FALSE))","v":2.2000000000000001E-3},{"$f":"IF(ISERROR(VLOOKUP($AY7&$AZ7,CompositionLiquid,1,FALSE)),0,VLOOKUP($AY7&$AZ7,CompositionLiquid,4,FALSE))","v":1.8E-3},{"$f":"IF(ISERROR(VLOOKUP($AY7&$AZ7,CompositionLiquid,1,FALSE)),0,VLOOKUP($AY7&$AZ7,CompositionLiquid,5,FALSE)*2.29)","v":1.9464999999999999E-3},{"$f":"IF(ISERROR(VLOOKUP($AY7&$AZ7,CompositionLiquid,1,FALSE)),0,VLOOKUP($AY7&$AZ7,CompositionLiquid,6,FALSE)*1.2)","v":4.9800000000000001E-3},{"$f":"IF(ISERROR(VLOOKUP($AY7&$AZ7,CompositionLiquid,1,FALSE)),0,VLOOKUP($AY7&$AZ7,CompositionLiquid,7,FALSE))","v":2.0588235294117648E-4},null,null,null,null,null,"Tractor and Pull Type Manure Spreader",true,1,null,null,{"$f":"INDEX(BN47,BS6)","v":"Solid Manure Spreader"},{"$f":"INDEX(BS10:BS13,BT6)","v":"H.D. Cultivator - Once Over"},{"$f":"INDEX(BS16:BS20,BU6)","v":"Incorporated within 1 day"},null,{"$f":"INDEX(BN85:BN86,BW6)","v":"Source in Yard - Travel to Source"},null,null,"In Yard","In Field",null,null,null,"Blend %","lbs/tonne","$/lb","Cost/tonne"]
[null,"Medium",null,"Winter Wheat","bu",1.35,0.61,1.42,0.2,null,"Brown",2.4,"1.9 - 2.9",28,"27 - 29",{"$f":"N8*1.12","v":31.360000000000003},"30 - 32",null,null,null,"Dairy",null,"Beef","Finishers – Open Lot",null,"BeefFinishers – Paved Lot",19.8,0.43,null,null,null,null,null,"BeefFinishers – Paved Lot",{"$f":"14/2000","v":7.0000000000000001E-3},4.3E-3,2.7000000000000001E-3,8.4999999999999995E-4,3.7499999999999999E-3,8.4999999999999995E-4,null,null,null,null,null,null,null,null,null,null,null,null,null,null,null,null,null,null,null,null,null,null,null,null,null,"Tandem Truck",true,1,null,null,null,null,null,null,null,null,"Spreader Hopper Size",{"$f":"IF(ISBLANK(SolidEquipVarUser1),SolidEquipVarDefault1,SolidEquipVarUser1)","v":250},{"$f":"BZ8","v":250},"cu.ft.",null,"N",{"$f":"VLOOKUP(CI$6,FertilizerBlend,2,FALSE)","v":{"$error":"#N/A"}},{"$f":"CE8*2205","v":{"$error":"#N/A"}},{"$f":"IF($CI6='Commercial Fertilizer'!$J$10,'Commercial Fertilizer'!$E$10,'Commercial Fertilizer'!$E$11)","v":0.50280981958000592},{"$f":"CG8*CF8","v":{"$error":"#N/A"}}]
{"$rows_left_out":108}
{"sheet":"Composition 1","index":12,"n_rows":61,"n_cols":15,"rows_kept":61,"cut":false,"hidden":true,"merged":[[60,1,60,2],[59,9,60,9],[59,10,60,10],[59,11,60,11],[59,5,60,5],[59,6,60,6],[59,7,60,7],[57,7,58,7],[59,8,60,8],[58,1,58,2],[59,1,59,2],[59,3,60,3],[59,4,60,4],[57,1,57,2],[57,3,58,3],[57,5,58,5],[57,6,58,6],[57,8,58,8],[57,9,58,9],[52,12,54,12],[52,13,54,13],[55,12,56,12],[52,11,54,11],[52,10,54,10],[55,10,56,10],[55,11,56,11],[59,13,60,13],[59,14,60,14],[59,12,60,12],[52,14,54,14],[57,10,58,10],[57,12,58,12],[57,13,58,13],[55,14,56,14],[57,11,58,11],[55,13,56,13],[57,14,58,14],[55,7,56,7],[55,8,56,8],[55,9,56,9],[46,1,46,2],[46,3,47,3],[46,4,47,4],[46,5,47,5],[50,1,50,2],[51,1,51,2],[52,3,54,3],[52,4,54,4],[52,9,54,9],[47,1,47,2],[52,6,54,6],[52,7,54,7],[52,8,54,8],[52,5,54,5],[55,2,56,2],[55,5,56,5],[55,6,56,6],[48,8,49,8],[48,9,49,9],[48,2,49,2],[48,3,49,3],[48,5,49,5],[48,6,49,6],[48,7,49,7],[46,11,47,11],[46,12,47,12],[46,6,47,6],[46,7,47,7],[46,8,47,8],[46,9,47,9],[48,11,49,11],[48,12,49,12],[48,10,49,10],[48,13,49,13],[48,14,49,14],[44,3,45,3],[44,4,45,4],[44,5,45,5],[44,6,45,6],[42,3,43,3],[42,4,43,4],[42,5,43,5],[42,6,43,6],[44,13,45,13],[42,13,43,13],[42,14,43,14],[44,14,45,14],[44,7,45,7],[44,8,45,8],[44,9,45,9],[44,10,45,10],[44,11,45,11],[44,12,45,12],[46,14,47,14],[46,13,47,13],[46,10,47,10],[48,4,49,4],[40,13,41,13],[40,14,41,14],[40,7,41,7],[40,8,41,8],[40,9,41,9],[40,10,41,10],[40,11,41,11],[40,12,41,12],[42,7,43,7],[42,8,43,8],[42,9,43,9],[42,10,43,10],[42,11,43,11],[42,12,43,12],[38,14,39,14],[36,14,37,14],[38,2,39,2],[38,3,39,3],[38,4,39,4],[38,5,39,5],[38,6,39,6],[40,3,41,3],[40,4,41,4],[40,5,41,5],[40,6,41,6],[38,9,39,9],[36,9,37,9],[38,7,39,7],[38,8,39,8],[38,12,39,12],[38,13,39,13],[38,10,39,10],[36,10,37,10],[36,11,37,11],[36,13,37,13],[38,11,39,11],[36,12,37,12],[36,8,37,8],[35,1,35,2],[36,2,37,2],[36,3,37,3],[36,4,37,4],[36,5,37,5],[36,6,37,6],[36,7,37,7],[34,10,35,10],[34,11,35,11],[34,1,34,2],[34,3,35,3],[34,4,35,4],[34,5,35,5],[34,6,35,6],[34,7,35,7],[34,8,35,8],[34,9,35,9],[31,13,32,13],[31,14,32,14],[31,7,32,7],[31,8,32,8],[31,9,32,9],[31,10,32,10],[31,11,32,11],[31,12,32,12],[34,14,35,14],[34,12,35,12],[34,13,35,13],[29,2,30,2],[29,4,30,4],[29,5,30,5],[29,6,30,6],[29,7,30,7],[29,8,30,8],[31,3,32,3],[31,4,32,4],[31,5,32,5],[31,6,32,6],[29,13,30,13],[27,13,28,13],[27,14,28,14],[29,14,30,14],[19,14,20,14],[23,9,26,9],[23,10,26,10],[23,11,26,11],[23,12,26,12],[23,13,26,13],[29,11,30,11],[29,12,30,12],[27,11,28,11],[27,12,28,12],[27,9,28,9],[27,10,28,10],[29,9,30,9],[29,10,30,10],[19,12,20,12],[19,13,20,13],[21,14,22,14],[27,3,28,3],[27,4,28,4],[27,5,28,5],[27,6,28,6],[27,7,28,7],[27,8,28,8],[23,4,26,4],[23,14,26,14],[21,12,22,12],[21,13,22,13],[23,5,26,5],[23,6,26,6],[23,7,26,7],[23,8,26,8],[19,2,20,2],[19,4,20,4],[19,5,20,5],[19,6,20,6],[19,11,20,11],[21,2,22,2],[21,4,22,4],[21,5,22,5],[21,6,22,6],[21,7,22,7],[21,8,22,8],[21,9,22,9],[21,10,22,10],[21,11,22,11],[11,14,12,14],[13,9,14,9],[11,8,12,8],[11,9,12,9],[11,12,12,12],[11,13,12,13],[11,10,12,10],[11,11,12,11],[19,7,20,7],[19,8,20,8],[19,9,20,9],[19,10,20,10],[13,2,14,2],[13,4,14,4],[13,5,14,5],[13,6,14,6],[13,7,14,7],[13,8,14,8],[3,9,4,10],[3,11,4,12],[3,13,4,14],[4,1,4,2],[3,1,3,2],[3,4,5,4],[3,5,4,6],[3,7,4,8],[5,1,5,2],[13,14,14,14],[13,10,14,10],[13,11,14,11],[13,12,14,12],[13,13,14,13],[11,4,12,4],[11,5,12,5],[11,6,12,6],[11,7,12,7]]}
[]
[null,null,"NPK composition of manure"]
[]
[null,"   ",null,null,"Total N % Range","Total N –Typical",null,"Available N",null,"Crop N",null,"Total  P",null,"Total  K"]
[null,"Type of Livestock",null,"Moisture"]
[null,null,null,"%",null,"lbs/ton","kg/tonne","lbs/ton","kg/tonne","lbs/ton","kg/tonne",null,null,"lbs/ton","   kg/tonne"]
[null,null,"Feeders"]
[null,null,"Finishers","30 – 70","0.65 – 1.25",20,10,5.0999999999999996,2.6,6.5,3.2,4.8,2.4,13.3,6.7]
{"$rows_left_out":54}
{"sheet":"NPK Composition Wet & Dry Basis","index":13,"n_rows":40,"n_cols":48,"rows_kept":40,"cut":false,"hidden":true,"merged":[[1,46,1,47],[2,44,2,45],[2,46,2,47],[1,40,1,41],[1,42,1,43],[2,40,2,41],[2,42,2,43],[0,7,0,19],[1,16,1,17],[2,16,2,17],[1,44,1,45],[1,20,1,21],[2,20,2,21],[1,18,1,19],[1,25,1,26],[2,18,2,19],[2,25,2,26],[1,38,1,39],[1,23,1,24],[1,36,1,37],[1,27,1,28],[1,29,1,30],[1,31,1,32],[1,33,1,34],[2,38,2,39],[2,23,2,24],[2,36,2,37],[2,27,2,28],[2,29,2,30],[2,31,2,32],[2,33,2,34],[1,0,1,1],[2,0,2,1],[3,0,3,1],[2,14,2,15],[1,14,1,15],[1,2,2,5],[1,6,1,9],[2,6,2,9],[1,12,1,13],[2,12,2,13],[1,10,1,11],[2,10,2,11]]}
[null,null,null,null,null,null,null,"Manure Composition (Moisture, Nitrogen, Phosphorus and Potassum) Wet and Dry Basis"]
["   ",null,"% Moisture",null,null,null,"Total N %",null,null,null,"Total N –Typical",null,"Total N –Typical",null,"Available N",null,"Available N",null,"Crop N",null,"Crop N",null,"Total P %","Total  P",null,"Total  P",null,"Total  P2O5",null,"Available  P2O5",null,"Total  P2O5",null,"Available  P2O5",null,"Total K %","Total  K",null,"Total  K",null,"Total  K2O",null,"Available  K2O",null,"Total  K2O",null,"Available  K2O"]
["Type of Livestock",null,null,null,null,null,"Wet Basis",null,null,null,"Wet Basis",null,"Dry Basis",null,"Wet Basis",null,"Dry Basis",null,"Wet Basis",null,"Dry Basis",null,"Wet Basis","Wet Basis",null,"Dry Basis",null,"Wet Basis",null,"Wet Basis",null,"Dry Basis",null,"Dry Basis",null,"Wet Basis","Wet Basis",null,"Dry Basis",null,"Wet Basis",null,"Wet Basis",null,"Dry Basis",null,"Dry Basis"]
[null,null,"Range","Min","Max","Mean","Range","Min","Max","Mean","lbs/ton","kg/tonne","lbs/ton","kg/tonne","lbs/ton","kg/tonne","lbs/ton","kg/tonne","lbs/ton","kg/tonne","lbs/ton","kg/tonne","Mean","lbs/ton","kg/tonne","lbs/ton","kg/tonne","lbs/ton","kg/tonne","lbs/ton","kg/tonne","lbs/ton","kg/tonne","lbs/ton","kg/tonne","Mean","lbs/ton","kg/tonne","lbs/ton","kg/tonne","lbs/ton","kg/tonne","lbs/ton","kg/tonne","lbs/ton","kg/tonne","lbs/ton","kg/tonne"]
[null,null,null,null,null,null,null,null,null,null,{"$f":"K6/2000","v":9.4999999999999998E-3},null,{"$f":"M6/2000","v":1.9E-2},null,{"$f":"O6/2000","v":2.5499999999999997E-3},null,{"$f":"Q6/2000","v":5.0999999999999995E-3},null,{"$f":"S6/2000","v":3.2499999999999999E-3},null,{"$f":"U6/2000","v":6.4999999999999997E-3},null,null,{"$f":"X6/2000","v":2.3999999999999998E-3},null,{"$f":"Z6/2000","v":4.7999999999999996E-3},null,{"$f":"AB6/2000","v":5.4959999999999991E-3},null,{"$f":"AD6/2000","v":2.7479999999999996E-3},null,{"$f":"AF6/2000","v":1.0991999999999998E-2},null,{"$f":"AH6/2000","v":5.4959999999999991E-3},null,null,{"$f":"AK6/2000","v":6.7000000000000002E-3},null,{"$f":"AM6/2000","v":1.34E-2},null,{"$f":"AO6/2000","v":8.0399999999999985E-3},null,{"$f":"AQ6/2000","v":7.2359999999999994E-3},null,{"$f":"AS6/2000","v":1.6079999999999997E-2},null,{"$f":"AU6/2000","v":1.4471999999999999E-2}]
[null,"Feeders","30 – 70",30,70,{"$f":"AVERAGE(D6:E6)","v":50},"0.65 – 1.25",0.65,1.25,{"$f":"AVERAGE(H6:I6)","v":0.95},{"$f":"($J6/100)*2000","v":19},{"$f":"($J6/100)*1000","v":9.5},{"$f":"($K6)*(100/$F6)","v":38},{"$f":"($L6)*(100/$F6)","v":19},5.0999999999999996,2.6,{"$f":"($O6)*(100/$F6)","v":10.199999999999999},{"$f":"($P6)*(100/$F6)","v":5.2},6.5,3.2,{"$f":"($S6)*(100/$F6)","v":13},{"$f":"($T6)*(100/$F6)","v":6.4},0.24,{"$f":"($W6/100)*2000","v":4.8},{"$f":"($W6/100)*1000","v":2.4},{"$f":"($W6/100)*2000*(100/$F6)","v":9.6},{"$f":"($W6/100)*1000*(100/$F6)","v":4.8},{"$f":"($W6/100)*2000*2.29","v":10.991999999999999},{"$f":"($W6/100)*1000*2.29","v":5.4959999999999996},{"$f":"($W6/100)*2000*2.29*0.5","v":5.4959999999999996},{"$f":"($W6/100)*1000*2.29*0.5","v":2.7479999999999998},{"$f":"($Z6)*2.29","v":21.983999999999998},{"$f":"($AA6)*2.29","v":10.991999999999999},{"$f":"($AF6)*0.5","v":10.991999999999999},{"$f":"($AG6)*0.5","v":5.4959999999999996},0.67,{"$f":"($AJ6/100)*2000","v":13.4},{"$f":"($AJ6/100)*1000","v":6.7},{"$f":"($AJ6/100)*2000*(100/$F6)","v":26.8},{"$f":"($AJ6/100)*1000*(100/$F6)","v":13.4},{"$f":"($AJ6/100)*2000*1.2","v":16.079999999999998},{"$f":"($AJ6/100)*1000*1.2","v":8.0399999999999991},{"$f":"($AO6)*0.9","v":14.472},{"$f":"($AP6)*0.9","v":7.2359999999999998},{"$f":"($AM6)*1.2","v":32.159999999999997},{"$f":"($AN6)*1.2","v":16.079999999999998},{"$f":"($AS6)*0.9","v":28.943999999999999},{"$f":"($AT6)*0.9","v":14.472}]
[null,"Finishers","30 – 70",30,70,50,"0.65 – 1.25",0.65,1.25,{"$f":"AVERAGE(H7:I7)","v":0.95},19,9.5,38,19,5.0999999999999996,2.6,10.199999999999999,5.2,6.5,3.2,13,6.4,0.24,4.8,2.4,9.6,4.8,10.991999999999999,5.4959999999999996,5.4959999999999996,2.7479999999999998,21.983999999999998,10.991999999999999,10.991999999999999,5.4959999999999996,0.67,13.4,6.7,26.8,13.4,16.079999999999998,8.0399999999999991,14.472,7.2359999999999998,32.159999999999997,16.079999999999998,28.943999999999999,14.472]
["Beef","Feeder Calves","30 – 70",30,70,50,"0.65 – 1.25",0.65,1.25,{"$f":"AVERAGE(H8:I8)","v":0.95},19,9.5,38,19,5.0999999999999996,2.6,10.199999999999999,5.2,6.5,3.2,13,6.4,0.24,4.8,2.4,9.6,4.8,10.991999999999999,5.4959999999999996,5.4959999999999996,2.7479999999999998,21.983999999999998,10.991999999999999,10.991999999999999,5.4959999999999996,0.67,13.4,6.7,26.8,13.4,16.079999999999998,8.0399999999999991,14.472,7.2359999999999998,32.159999999999997,16.079999999999998,28.943999999999999,14.472]
{"$rows_left_out":33}
{"sheet":"Uptake Imperial","index":14,"n_rows":40,"n_cols":14,"rows_kept":40,"cut":false,"hidden":true,"merged":[]}
[null,"Yield",null,"N Uptake lb/Unit",null,null,"P2O5 Uptake lb/Unit",null,null,"K2O Uptake lb/Unit",null,null,"S Uptake lb/Unit"]
["Crop","Units","Min","Max","Mean","Min","Max","Mean","Min","Max","Mean","Min","Max","Mean"]
["Spring Wheat","bu",1.9,2.3250000000000002,2.1124999999999998,0.72499999999999998,0.875,0.8,1.625,2,1.8125,0.2,0.25,0.22500000000000001]
["Winter Wheat","bu",1.22,1.48,1.35,0.54,0.68,0.61,1.28,1.56,1.42,0.18,0.22,0.2]
["Barley","bu",1.25,1.5249999999999999,1.3875,0.5,0.61250000000000004,0.55625000000000002,1.2,1.4624999999999999,1.33125,0.15,0.17499999999999999,0.16250000000000001]
["Oats","bu",0.96,1.17,1.0649999999999999,0.36,0.45,0.40500000000000003,1.31,1.6,1.4550000000000001,0.12,0.14000000000000001,0.13]
["Rye","bu",1.509090909090909,1.8363636363636364,1.6727272727272726,0.74545454545454548,0.92727272727272725,0.83636363636363631,2.1272727272727274,2.6181818181818182,2.3727272727272726,0.25454545454545452,0.30909090909090908,0.2818181818181818]
["Corn","bu",1.38,1.68,1.53,0.56999999999999995,0.69,0.63,1.1599999999999999,1.41,1.2849999999999999,0.13,0.16,0.14499999999999999]
{"$rows_left_out":32}